{"text_format":"3","workbook":"xlsx","n_sheets":3,"sheets":["Disclaimer","Tool","Data"],"not_rendered":{"images":20,"macros":1,"comments":4},"read":"whole","date_system":"1900"}

{"sheet":"Disclaimer","index":0,"n_rows":1,"n_cols":4,"rows_kept":1,"merged":[[0,3,14,9]]}
[{"$nulls":3},"Enable macros to use PowerShare Design Tool\n\nIf you experience a security risk warning, go to the file's properties > general tab > at the bottom security >  unblock \n\nThis tool is designed to help you to understand the power sharing capabilities in PowerShareX amplifiers. With this tool you can choose an amplifier and specify the loudspeakers for the system configuration you want to review. Results are estimated values and may be used as a starting point for your system design.  Please also refer to the amplifier technical data sheets when reviewing your system design plan.\n\nv1.0.3 add loudspeaker options for DesignMax DML88P and DM12SE, EdgeMax EM180-LP and EM90-LP, Forum FC108 and FC112, ShowTime SK12, 402 Series V, and 802 Series V."]

{"sheet":"Tool","index":1,"n_rows":175,"n_cols":43,"rows_kept":175,"merged":[[8,2,8,3],[10,2,10,9],[10,10,10,11],[15,10,15,11],[29,10,29,11],[30,28,30,29],[30,30,30,31],[32,2,32,9],[101,2,101,9],[138,35,139,35]]}
[{"$nulls":10},{"$f":"IF(E10<0.999*O43,\"I<Imax\",IF(E10>1.001*O43,\"I>Imax\",\"I@Imax\"))","v":"I>Imax"},{"$f":"IF(L39>0.01,\"Pdes<Pmax\",IF(L39<-0.01,\"Pdes>Pmax\",\"Pdes@Pmax\"))","v":"Pdes<Pmax"},{"$f":"IF(L4=\"Pavg ok\",IF(K4>3,CONCATENATE(\"The amplifier should only need \",ROUND(K132,1),\"A as an average over time. \"),\"\"),\"\")","v":"The amplifier should only need 0.4A as an average over time. "},null,null,"PS404D","PS604D","Quattrocanali 8804",{"$f":"LEN(S2)","v":19},null,null,"T904","T604","T304","X4","X4L"]
[null,null,"Hi-Z calculator",{"$nulls":3},"Lo-Z",{"$nulls":3},"Pmains max at ",{"$f":"MAX(K132,AVERAGE(O12/O40/C10,O42/C10))","v":{"v":6.415694591728526,"d":"6.4 Arms"}},{"$f":"IF(K1=\"I<Imax\",IF(K3<-0.01,IF(L1=\"Pdes<Pmax\",IF(L4=\"Pavg<Pdes\",\"The amplifier can deliver the desired average power if the mains current is increased. \",\"\"),\"\"),\"\"),\"\")","v":""},"Amplifier data","Selected",{"$nulls":3},"PowerShare PSX4804D","PowerShare PSX2404D","PowerShare PSX1204D",{"$nulls":13},"Voltage alternatives"]
[null,null,"P",{"v":60,"d":"60 W"},null,null,"100V",{"$f":"SQRT(2)*100","v":{"v":141.4213562373095,"d":"141.4"}},null,null,{"$f":"10*LOG10(L2/O43)","v":{"v":-0.6781758147655953,"d":"-0.7 dB"}},"vs Imax",{"$f":"IF(E10<L2,IF(L1=\"Pdes>Pmax\",IF(K5<-0.01,\"It can get closer to the desired average power with a higher mains current availability. \",\"\"),\"\"),\"\")","v":""},"Max Ptot, burst",{"$f":"INDEX(P3:Z3,1,MATCH(C$9,P$2:Z$2,0))","v":{"v":1200,"d":"1200 W"}},{"v":400,"d":"400 W"},{"v":600,"d":"600 W"},{"v":9600,"d":"9600 W"},{"v":6000,"d":"6000 W"},{"v":2400,"d":"2400 W"},{"v":1200,"d":"1200 W"},{"v":8000,"d":"8000 W"},{"v":6000,"d":"6000 W"},{"v":3000,"d":"3000 W"},{"v":20800,"d":"20800 W"},{"$f":"MIN(IF($C$35:$F$35>8200,25000,32800))","v":{"v":32800,"d":"32800 W"}},{"$f":"MIN(IF($C$35:$F$35>150,500,600))","v":{"v":600,"d":"600 W"}},{"$nulls":7},100]
[null,null,"Znom 25V",{"$f":"25^2/D3","v":{"v":10.416666666666666,"d":"10.4 ohm"}},null,null,"70V",{"v":100,"d":"100.0"},null,null,{"$f":"10*LOG10(E10/K132)","v":{"v":15.25399035619138,"d":"15.3 dB"}},{"$f":"IF(K138<-0.01,\"Pavg<Pdes\",\"Pavg ok\")","v":"Pavg ok"},{"$f":"IF(E10>L2*1.01,IF(E10<0.99*O43,IF(L4=\"Pavg<Pdes\",CONCATENATE(\"The desired total average power exceeds the capacity. It's expected to draw around \",ROUND(L2,1),\"A when it reaches its total average power capacity so increasing the available current won't let it reach the desired average power. \"),\"\"),\"\"),\"\")","v":""},null,null,{"v":100,"d":"100 W"},{"v":150,"d":"150 W"},{"v":2400,"d":"2400 W"},{"v":1200,"d":"1200 W"},{"v":600,"d":"600 W"},{"v":300,"d":"300 W"},{"v":2000,"d":"2000 W"},{"v":1250,"d":"1250 W"},{"v":750,"d":"750 W"},{"v":5200,"d":"5200 W"},{"v":4800,"d":"4800 W"},{"$nulls":8},115]
[null,null,"Znom 70V",{"$f":"100^2/2/D3","v":{"v":83.33333333333333,"d":"83.3 ohm"}},null,null,"Unused",{"$f":"SQRT(2)*25","v":{"v":35.35533905932738,"d":"35.4"}},null,null,{"$f":"10*LOG10(E10/L2)","v":{"v":3.6884757714054075,"d":"3.7 dB"}},null,{"$f":"IF(E10>O43*1.01,CONCATENATE(\"The amplifier is limited to \",O43,\"A. \"),\"\")","v":"The amplifier is limited to 7.5A. "},null,null,{"$f":"P3/8","v":{"v":50,"d":"50 W"}},{"$f":"Q3/8","v":{"v":75,"d":"75 W"}},{"$f":"R3/8","v":{"v":1200,"d":"1200 W"}},{"$f":"S3/8","v":{"v":750,"d":"750 W"}},{"$f":"T3/8","v":{"v":300,"d":"300 W"}},{"v":150,"d":"150 W"},{"v":1000,"d":"1000 W"},{"v":750,"d":"750 W"},{"v":375,"d":"375 W"},{"$f":"Y3/8","v":{"v":2600,"d":"2600 W"}},{"$f":"Z3/8","v":{"v":4100,"d":"4100 W"}},{"$nulls":8},120]
[null,null,"Znom 100V",{"$f":"100^2/D3","v":{"v":166.66666666666666,"d":"166.7 ohm"}},null,null,"Unused",{"$nulls":8},{"$f":"(P12-P39)*P16","v":{"v":55.875,"d":"56 W"}},{"v":85.715,"d":"86 W"},{"v":816.1999999999999,"d":"816 W"},{"v":875.4319999999999,"d":"875 W"},{"v":514.632,"d":"515 W"},{"v":424.432,"d":"424 W"},{"v":874.5,"d":"875 W"},{"v":875.4319999999999,"d":"875 W"},{"v":424.432,"d":"424 W"},{"v":1375.05,"d":"1375 W"},{"v":4289.8,"d":"4290 W"},{"$nulls":8},125]
[null,null,"PowerShare Design Tool",{"$nulls":10},"Max Ptot, avg",{"$f":"INDEX(P7:Z7,1,MATCH(C$9,P$2:Z$2,0))","v":{"v":360,"d":"360 W"}},{"$f":"MIN(P6,ROUND(AVERAGE(P6,P6,P6,P5),-1))","v":{"v":50,"d":"50 W"}},{"$f":"MIN(Q6,ROUND(AVERAGE(Q6,Q6,Q6,Q5),-1))","v":{"v":80,"d":"80 W"}},{"$f":"MIN(R6,ROUND(AVERAGE(R6,R6,R6,R5),-1))","v":{"v":816.1999999999999,"d":"816 W"}},{"$f":"MIN(S6,ROUND(AVERAGE(S6,S6,S6,S5),-1))","v":{"v":840,"d":"840 W"}},{"$f":"MIN(T6,ROUND(AVERAGE(T6,T6,T6,T5),-1))","v":{"v":460,"d":"460 W"}},{"v":360,"d":"360 W"},{"v":874.5,"d":"875 W"},{"v":840,"d":"840 W"},{"v":410,"d":"410 W"},{"$f":"(Y12-Y39)*Y31","v":{"v":1344.15,"d":"1344 W"}},{"$f":"(Z12-Z39)*Z31","v":{"v":4193.4,"d":"4193 W"}},{"$nulls":8},173]
[null,"User Input ",{"$nulls":10},"Instructions","Max Pburst/ch",{"$f":"INDEX(P8:Z8,1,MATCH(C$9,P$2:Z$2,0))","v":{"v":1100,"d":"1100 W"}},{"v":320,"d":"320 W"},{"v":600,"d":"600 W"},{"v":3500,"d":"3500 W"},{"v":2200,"d":"2200 W"},{"v":1200,"d":"1200 W"},{"v":1100,"d":"1100 W"},{"v":2300,"d":"2300 W"},{"v":2100,"d":"2100 W"},{"v":1200,"d":"1200 W"},{"v":5400,"d":"5400 W"},{"v":10000,"d":"10000 W"},{"$nulls":5},"Nominal",{"v":400,"d":"400 W"},null,208]
[null,"Amplifier model","PowerShare PSX1204D",{"$nulls":9},"Enable macros to use PowerShare Design Tool!","Lo-Z voltage",{"$f":"INDEX(P9:Z9,1,MATCH(C$9,P$2:Z$2,0))","v":{"v":70,"d":"70 Vpk"}},{"v":142,"d":"142.0 Vpk"},{"v":142,"d":"142.0 Vpk"},{"v":160,"d":"160.0 Vpk"},{"v":139,"d":"139.0 Vpk"},{"v":100,"d":"100.0 Vpk"},{"v":70,"d":"70.0 Vpk"},{"v":170,"d":"170.0 Vpk"},{"v":145,"d":"145.0 Vpk"},{"v":140,"d":"140.0 Vpk"},{"v":161,"d":"161 Vpk"},{"v":283,"d":"283.0 Vpk"},{"$nulls":5},"Actual",{"v":162,"d":"162 W"},null,220]
[null,"Mains",{"v":115,"d":"115 V"},{"v":15,"d":"15 A"},{"$f":"$D$10","v":{"v":15,"d":"15 A"}},{"$nulls":8},"Max Apeak/ch",{"$f":"INDEX(P10:Z10,1,MATCH(C$9,P$2:Z$2,0))","v":{"v":43,"d":"43 Apk"}},{"v":17.8,"d":"18 Apk"},{"v":17.8,"d":"18 Apk"},{"v":50,"d":"50 Apk"},{"v":45,"d":"45 Apk"},{"v":43,"d":"43 Apk"},{"v":43,"d":"43 Apk"},{"v":50,"d":"50 Apk"},{"v":40,"d":"40 Apk"},{"v":40,"d":"40 Apk"},{"v":86,"d":"86 Apk"},{"v":118,"d":"118 Apk"},{"$nulls":5},"Unused",{"$f":"AG8-AG9","v":{"v":238,"d":"238 W"}},null,230]
[null,null,"Channel",{"$nulls":9},"Gray cells = user adjustment","Max Vpeak/ch",{"v":145,"d":"145 Vpk"},{"v":142,"d":"142 Vpk"},{"v":142,"d":"142 Vpk"},{"v":160,"d":"160 Vpk"},{"v":139,"d":"139 Vpk"},{"v":145,"d":"145 Vpk"},{"v":145,"d":"145 Vpk"},{"v":169,"d":"169 Vpk"},{"v":145,"d":"145 Vpk"},{"v":145,"d":"145 Vpk"},{"v":161,"d":"161 Vpk"},{"v":283,"d":"283 Vpk"},{"$nulls":6},{"$f":"-10*LOG10(AG9/AG8)","v":{"v":3.925449767853314,"d":"3.9 dB"}},null,240]
[null,"Loudspeaker Information",1,2,3,4,5,6,7,8,{"$nulls":3},"P act mains slow",{"v":550,"d":"550 W"},{"v":90,"d":"90 W"},{"v":128,"d":"128 W"},{"v":1200,"d":"1200 W"},{"v":1100,"d":"1100 W"},{"v":660,"d":"660 W"},{"v":550,"d":"550 W"},{"v":1200,"d":"1200 W"},{"v":1100,"d":"1100 W"},{"v":550,"d":"550 W"},{"$f":"IF($C10*$E10>5000,5000,($C10*$E10))","v":{"v":1725,"d":"1725 W"}},{"v":5000,"d":"5000 W"}]
[null,"Bose Professional Loudspeaker ","FS2","FS2","FS2","FS2",{"$nulls":6},"Select loudspeaker."]
[null,"Loudspeaker type ","Lo-Z","Lo-Z","Lo-Z","Lo-Z","Unused","Unused","Unused","Unused",null,null,"Select: Lo-Z / 100V / 70V / Unused. Unused must be selected when appropriate for headroom to\n be accurate. "]
[null,"Loudspeaker type OLD HIDDEN","Lo-Z","Lo-Z","Lo-Z","Lo-Z"]
[null,"#Speakers in parallel ",1,1,1,1,1,1,1,1,null,null,"Enter number of parallel speakers per channel.","n_net_eff1",{"$f":"INDEX(P16:Z16,1,MATCH(C$9,P$2:Z$2,0))","v":{"v":0.82,"d":"82%"}},{"v":0.75,"d":"75%"},{"v":0.79,"d":"79%"},{"v":0.7,"d":"70%"},{"v":0.82,"d":"82%"},{"v":0.82,"d":"82%"},{"v":0.82,"d":"82%"},{"v":0.75,"d":"75%"},{"v":0.82,"d":"82%"},{"v":0.82,"d":"82%"},{"v":0.89,"d":"89%"},{"v":0.89,"d":"89%"}]
[null,"#Cabinets in parallel OLD HIDDEN",1,1,1,1]
[null,"Tap Setting (70/100V) ",{"v":16,"d":"16 W"},{"v":16,"d":"16 W"},{"v":16,"d":"16 W"},{"v":16,"d":"16 W"},{"$nulls":6},"Select.  Note that the lowest tap is sometimes not available in 100v, check technical data sheet for \n details"]
[null,"RMS power - single speaker ",{"$f":"VLOOKUP(C$13,Data!$D$22:$F$71,2,0)","v":{"v":16,"d":"16 W"}},{"$f":"VLOOKUP(D$13,Data!$D$22:$F$71,2,0)","v":{"v":16,"d":"16 W"}},{"$f":"VLOOKUP(E$13,Data!$D$22:$F$71,2,0)","v":{"v":16,"d":"16 W"}},{"$f":"VLOOKUP(F$13,Data!$D$22:$F$71,2,0)","v":{"v":16,"d":"16 W"}}]
[null,"Nominal impedance Lo-Z OLD HIDDEN",{"$f":"VLOOKUP(C$13,Data!$D$22:$F$71,3,0)","v":{"v":16,"d":"16.0 ohm"}},{"$f":"VLOOKUP(D$13,Data!$D$22:$F$71,3,0)","v":{"v":16,"d":"16.0 ohm"}},{"$f":"VLOOKUP(E$13,Data!$D$22:$F$71,3,0)","v":{"v":16,"d":"16.0 ohm"}},{"$f":"VLOOKUP(F$13,Data!$D$22:$F$71,3,0)","v":{"v":16,"d":"16.0 ohm"}}]
[null,"Highest Tap choice 70V/100V",{"$f":"IF(VLOOKUP(C$13,Data!$D$22:$L$71,4,0)=\"\",\"\",VLOOKUP(C$13,Data!$D$22:$L$71,4,0))","v":{"v":16,"d":"16 W"}},{"$f":"IF(VLOOKUP(D$13,Data!$D$22:$L$71,4,0)=\"\",\"\",VLOOKUP(D$13,Data!$D$22:$L$71,4,0))","v":{"v":16,"d":"16 W"}},{"$f":"IF(VLOOKUP(E$13,Data!$D$22:$L$71,4,0)=\"\",\"\",VLOOKUP(E$13,Data!$D$22:$L$71,4,0))","v":{"v":16,"d":"16 W"}},{"$f":"IF(VLOOKUP(F$13,Data!$D$22:$L$71,4,0)=\"\",\"\",VLOOKUP(F$13,Data!$D$22:$L$71,4,0))","v":{"v":16,"d":"16 W"}},{"$nulls":21},"Profile","Active power","Crest factor","Average reduction","RMS Scaling"]
[null,"Next Tap choice 70V/100V",{"$f":"IF(VLOOKUP(C$13,Data!$D$22:$L$71,5,0)=\"\",\"\",VLOOKUP(C$13,Data!$D$22:$L$71,5,0))","v":{"v":8,"d":"8 W"}},{"$f":"IF(VLOOKUP(D$13,Data!$D$22:$L$71,5,0)=\"\",\"\",VLOOKUP(D$13,Data!$D$22:$L$71,5,0))","v":{"v":8,"d":"8 W"}},{"$f":"IF(VLOOKUP(E$13,Data!$D$22:$L$71,5,0)=\"\",\"\",VLOOKUP(E$13,Data!$D$22:$L$71,5,0))","v":{"v":8,"d":"8 W"}},{"$f":"IF(VLOOKUP(F$13,Data!$D$22:$L$71,5,0)=\"\",\"\",VLOOKUP(F$13,Data!$D$22:$L$71,5,0))","v":{"v":8,"d":"8 W"}},{"$nulls":21},"SW",{"v":14,"d":"14 dB"},{"v":12,"d":"12 dB"},{"v":2,"d":"2.0 dB"},{"v":0.7,"d":"0.70"}]
[null,"Next Tap choice 70V/100V",{"$f":"IF(VLOOKUP(C$13,Data!$D$22:$L$71,6,0)=\"\",\"\",VLOOKUP(C$13,Data!$D$22:$L$71,6,0))","v":{"v":4,"d":"4 W"}},{"$f":"IF(VLOOKUP(D$13,Data!$D$22:$L$71,6,0)=\"\",\"\",VLOOKUP(D$13,Data!$D$22:$L$71,6,0))","v":{"v":4,"d":"4 W"}},{"$f":"IF(VLOOKUP(E$13,Data!$D$22:$L$71,6,0)=\"\",\"\",VLOOKUP(E$13,Data!$D$22:$L$71,6,0))","v":{"v":4,"d":"4 W"}},{"$f":"IF(VLOOKUP(F$13,Data!$D$22:$L$71,6,0)=\"\",\"\",VLOOKUP(F$13,Data!$D$22:$L$71,6,0))","v":{"v":4,"d":"4 W"}},{"$nulls":21},"LF",{"$f":"AD23+AE23","v":{"v":15.4,"d":"15 dB"}},{"v":14,"d":"14 dB"},{"v":1.4,"d":"1.4 dB"},0.65]
[null,"Next Tap choice 70V/100V",{"$f":"IF(VLOOKUP(C$13,Data!$D$22:$L$71,7,0)=\"\",\"\",VLOOKUP(C$13,Data!$D$22:$L$71,7,0))","v":{"v":2,"d":"2 W"}},{"$f":"IF(VLOOKUP(D$13,Data!$D$22:$L$71,7,0)=\"\",\"\",VLOOKUP(D$13,Data!$D$22:$L$71,7,0))","v":{"v":2,"d":"2 W"}},{"$f":"IF(VLOOKUP(E$13,Data!$D$22:$L$71,7,0)=\"\",\"\",VLOOKUP(E$13,Data!$D$22:$L$71,7,0))","v":{"v":2,"d":"2 W"}},{"$f":"IF(VLOOKUP(F$13,Data!$D$22:$L$71,7,0)=\"\",\"\",VLOOKUP(F$13,Data!$D$22:$L$71,7,0))","v":{"v":2,"d":"2 W"}},{"$nulls":21},"MF",{"$f":"AD24+AE24","v":{"v":17.2,"d":"17 dB"}},{"v":16,"d":"16 dB"},{"v":1.2,"d":"1.2 dB"},{"v":0.6,"d":"0.60"}]
[null,"Next Tap choice 70V/100V",{"$f":"IF(VLOOKUP(C$13,Data!$D$22:$L$71,8,0)=\"\",\"\",VLOOKUP(C$13,Data!$D$22:$L$71,8,0))","v":{"v":1,"d":"1 W"}},{"$f":"IF(VLOOKUP(D$13,Data!$D$22:$L$71,8,0)=\"\",\"\",VLOOKUP(D$13,Data!$D$22:$L$71,8,0))","v":{"v":1,"d":"1 W"}},{"$f":"IF(VLOOKUP(E$13,Data!$D$22:$L$71,8,0)=\"\",\"\",VLOOKUP(E$13,Data!$D$22:$L$71,8,0))","v":{"v":1,"d":"1 W"}},{"$f":"IF(VLOOKUP(F$13,Data!$D$22:$L$71,8,0)=\"\",\"\",VLOOKUP(F$13,Data!$D$22:$L$71,8,0))","v":{"v":1,"d":"1 W"}},{"$nulls":6}," (Lowest tap sometimes not available in 100v, check loudspeaker technical data sheet)",{"$nulls":14},"HF",{"$f":"AD25+AE25","v":{"v":19.8,"d":"20 dB"}},{"v":19,"d":"19 dB"},{"v":0.8,"d":"0.8 dB"},0.55]
[null,"Next Tap choice 70V/100V",{"$f":"IF(VLOOKUP(C$13,Data!$D$22:$L$71,9,0)=\"\",\"\",VLOOKUP(C$13,Data!$D$22:$L$71,9,0))","v":""},{"$f":"IF(VLOOKUP(D$13,Data!$D$22:$L$71,9,0)=\"\",\"\",VLOOKUP(D$13,Data!$D$22:$L$71,9,0))","v":""},{"$f":"IF(VLOOKUP(E$13,Data!$D$22:$L$71,9,0)=\"\",\"\",VLOOKUP(E$13,Data!$D$22:$L$71,9,0))","v":""},{"$f":"IF(VLOOKUP(F$13,Data!$D$22:$L$71,9,0)=\"\",\"\",VLOOKUP(F$13,Data!$D$22:$L$71,9,0))","v":""},{"$nulls":21},"FR",{"$f":"AD26+AE26","v":{"v":16.820599913279622,"d":"17 dB"}},{"$f":"10*LOG10(40)","v":{"v":16.02059991327962,"d":"16 dB"}},{"v":0.8,"d":"0.8 dB"},{"v":0.6,"d":"0.60"}]
[null,"Profile HIDDEN",{"$f":"VLOOKUP(C$13,Data!$D$22:$M$71,10,0)","v":"FR"},{"$f":"VLOOKUP(D$13,Data!$D$22:$M$71,10,0)","v":"FR"},{"$f":"VLOOKUP(E$13,Data!$D$22:$M$71,10,0)","v":"FR"},{"$f":"VLOOKUP(F$13,Data!$D$22:$M$71,10,0)","v":"FR"}]
[null,"Z nominal (LO-Z)",{"$f":"C20","v":{"v":16,"d":"16.0 ohm"}},{"$f":"D20","v":{"v":16,"d":"16.0 ohm"}},{"$f":"E20","v":{"v":16,"d":"16.0 ohm"}},{"$f":"F20","v":{"v":16,"d":"16.0 ohm"}},{"v":4,"d":"4.0 ohm"},{"v":4,"d":"4.0 ohm"},{"v":4,"d":"4.0 ohm"},{"v":4,"d":"4.0 ohm"},null,null,"Nominal impedance (when used in LO-Z)",null,{"$f":"INDEX(P28:Z28,1,MATCH(C$9,P$2:Z$2,0))","v":{"v":990,"d":"990 W"}},{"$f":"0.9*P8","v":{"v":288,"d":"288 W"}},{"v":540,"d":"540 W"},{"v":3150,"d":"3150 W"},{"v":1980,"d":"1980 W"},{"v":1080,"d":"1080 W"},{"v":990,"d":"990 W"},{"v":2070,"d":"2070 W"},{"v":1890,"d":"1890 W"},{"v":1080,"d":"1080 W"},{"v":5400,"d":"5400 W"},{"v":10000,"d":"10000 W"}]
[null,"PRMS (or Hi-Z tap setting)  ",{"$f":"IF(C14=\"Lo-Z\",C19,IF(C14=\"70V\",C18,IF(C14=\"100V\",C18,\"\")))","v":{"v":16,"d":"16 W"}},{"$f":"IF(D14=\"Lo-Z\",D19,IF(D14=\"70V\",D18,IF(D14=\"100V\",D18,\"\")))","v":{"v":16,"d":"16 W"}},{"$f":"IF(E14=\"Lo-Z\",E19,IF(E14=\"70V\",E18,IF(E14=\"100V\",E18,\"\")))","v":{"v":16,"d":"16 W"}},{"$f":"IF(F14=\"Lo-Z\",F19,IF(F14=\"70V\",F18,IF(F14=\"100V\",F18,\"\")))","v":{"v":16,"d":"16 W"}},{"v":100,"d":"100 W"},{"v":100,"d":"100 W"},{"v":100,"d":"100 W"},{"v":100,"d":"100 W"},null,null,"Bose Professional Power Handling, Long-term Continuous for one cabinet\n or the tap value of a Hi-Z loudspeaker","P ch slow",{"v":300,"d":"300 W"},{"v":36,"d":"36 W"},{"v":68,"d":"68 W"},{"v":550,"d":"550 W"},{"v":550,"d":"550 W"},{"v":300,"d":"300 W"},{"v":300,"d":"300 W"},{"v":550,"d":"550 W"},{"v":550,"d":"550 W"},{"v":300,"d":"300 W"},{"$f":"Y28/4","v":{"v":1350,"d":"1350 W"}},{"$f":"Z28/4","v":{"v":2500,"d":"2500 W"}}]
[null,"Profile HIDDEN",{"$f":"C27","v":"FR"},{"$f":"D27","v":"FR"},{"$f":"E27","v":"FR"},{"$f":"F27","v":"FR"},"SW","SW","SW","SW",null,null,"Select: SW / LF / MF / HF / FR","Vpk1",{"$f":"INDEX(P30:Z30,1,MATCH(C$9,P$2:Z$2,0))","v":{"v":145,"d":"145 Vpk"}},{"v":73,"d":"73 Vpk"},{"v":98,"d":"98 Vpk"},{"v":163,"d":"163 Vpk"},{"v":145,"d":"145 Vpk"},{"v":145,"d":"145 Vpk"},{"v":145,"d":"145 Vpk"},{"v":167,"d":"167 Vpk"},{"v":145,"d":"145 Vpk"},{"v":140,"d":"140 Vpk"},{"v":161,"d":"161 Vpk"},{"v":283,"d":"283 Vpk"}]
[null,"Average active power HIDDEN",{"$f":"INDEX($AC$22:$AC$30,MATCH(C$30,$AB$22:$AB$30,0),1)","v":{"v":16.820599913279622,"d":"16.8 dB"}},{"v":16.820599913279622,"d":"16.8 dB"},{"v":16.820599913279622,"d":"16.8 dB"},{"v":16.820599913279622,"d":"16.8 dB"},{"v":14,"d":"14.0 dB"},{"v":14,"d":"14.0 dB"},{"v":14,"d":"14.0 dB"},{"v":14,"d":"14.0 dB"},null,null,"READ ONLY! Combination of Crest factor and the fact that the speaker isn't a resistive load","n_net_eff2",{"v":0.49,"d":"49%"},{"v":0.63,"d":"63%"},{"v":0.66,"d":"66%"},{"v":0.62,"d":"62%"},{"v":0.49,"d":"49%"},{"v":0.49,"d":"49%"},{"v":0.49,"d":"49%"},{"v":0.63,"d":"63%"},{"v":0.49,"d":"49%"},{"v":0.49,"d":"49%"},{"v":0.87,"d":"87%"},{"v":0.87,"d":"87%"},null,null,"Peak Limiter",null,"RMS Limiter"]
[null,"User Output Offset ",{"v":0,"d":"0 dB"},{"v":0,"d":"0 dB"},{"v":0,"d":"0 dB"},{"v":0,"d":"0 dB"},{"v":100,"d":"100 dB"},{"v":0,"d":"0 dB"},{"v":0,"d":"0 dB"},{"v":0,"d":"0 dB"},{"$nulls":3},"Vpk2",{"v":1.5,"d":"2 Vpk"},{"v":39,"d":"39.0 Vpk"},{"v":28.5,"d":"28.5 Vpk"},{"v":78,"d":"78.0 Vpk"},{"v":60,"d":"60.0 Vpk"},{"v":400,"d":"400.0 Vpk"},{"v":10,"d":"10.0 Vpk"},{"v":78,"d":"78.0 Vpk"},{"v":60,"d":"60.0 Vpk"},{"v":60,"d":"60.0 Vpk"},{"v":56,"d":"56 Vpk"},{"v":173,"d":"173 Vpk"},null,"Profile","Attack","Release","Attack","Release"]
[null,"Amplifier Output","Channel",{"$nulls":7},"Total","Headroom",null,"k",2.444444444444444E-3,{"$f":"(P16-P31)/(P30-P32)","v":3.529411764705882E-3},1.8705035971223023E-3,9.4117647058823478E-4,3.88235294117647E-3,-1.2941176470588234E-3,2.444444444444444E-3,1.348314606741573E-3,3.88235294117647E-3,0.004124999999999999,1.9047619047619064E-4,1.8181818181818197E-4,null,"SW","16 - 32 ms","128 - 384 ms","2 - 4 sec","4- 8 sec"]
[null,null,{"$f":"C12","v":1},2,3,4,5,6,7,8,{"$nulls":3},"m",{"v":0.46555555555555556,"d":"46.6%"},{"$f":"P16-P30*P33","v":{"v":0.4923529411764706,"d":"49.2%"}},{"v":0.6066906474820144,"d":"60.7%"},{"v":0.5465882352941177,"d":"54.7%"},{"v":0.2570588235294118,"d":"25.7%"},{"v":1.0076470588235293,"d":"100.8%"},{"v":0.46555555555555556,"d":"46.6%"},{"v":0.5248314606741573,"d":"52.5%"},{"v":0.2570588235294118,"d":"25.7%"},{"v":0.24250000000000005,"d":"24.3%"},{"v":0.8593333333333333,"d":"85.9%"},{"v":0.8385454545454545,"d":"83.9%"},null,"LF","8 - 16 ms","64 - 256 ms","1 - 2 sec","2 - 4 sec"]
[null,"Power Requested",{"$f":"IF(C14=$G6,0.0000001,C29*IF(C14=$G2,2,1)*C16*10^(C32/10))","v":{"v":32,"d":"32 W"}},{"v":32,"d":"32 W"},{"v":32,"d":"32 W"},{"v":32,"d":"32 W"},{"v":1e-07,"d":"0 W"},{"v":1e-07,"d":"0 W"},{"v":1e-07,"d":"0 W"},{"v":1e-07,"d":"0 W"},{"$f":"SUM(C35:J35)","v":{"v":128.00000039999998,"d":"128 W"}},{"$f":"10*LOG10(O$3/K35)","v":{"v":9.719712750425863,"d":"9.7 dB"}},"Lo-Z speaker = PRMS x 2, Hi-Z speaker = rated power",{"$nulls":14},"MF","2 - 8 ms","16 - 64 ms","0,3 - 0,8 sec","0,5 - 2 sec"]
[null,"Asymetrical Rated Power Remaining\n   [Single Channel Consideration]",{"$f":"_xlfn.IFS($C$9=\"PowerShare PSX1204D\",$U$8-C35,$C$9=\"PowerShare PSX2404D\",$T$8-C35,$C$9=\"PowerShare PSX4804D\",$S$8-C35,TRUE,$U$8-C35)","v":{"v":1068,"d":"1068 W"}},{"$f":"_xlfn.IFS($C$9=\"PowerShare PSX1204D\",$U$8-D35,$C$9=\"PowerShare PSX2404D\",$T$8-D35,$C$9=\"PowerShare PSX4804D\",$S$8-D35,TRUE,$U$8-D35)","v":{"v":1068,"d":"1068 W"}},{"$f":"_xlfn.IFS($C$9=\"PowerShare PSX1204D\",$U$8-E35,$C$9=\"PowerShare PSX2404D\",$T$8-E35,$C$9=\"PowerShare PSX4804D\",$S$8-E35,TRUE,$U$8-E35)","v":{"v":1068,"d":"1068 W"}},{"$f":"_xlfn.IFS($C$9=\"PowerShare PSX1204D\",$U$8-F35,$C$9=\"PowerShare PSX2404D\",$T$8-F35,$C$9=\"PowerShare PSX4804D\",$S$8-F35,TRUE,$U$8-F35)","v":{"v":1068,"d":"1068 W"}}]
[null,"Peak Power Requested",{"$f":"C35*2","v":{"v":64,"d":"64 W"}},{"v":64,"d":"64 W"},{"v":64,"d":"64 W"},{"v":64,"d":"64 W"}]
[null,"Peak Power Remaining",{"v":2136,"d":"2136 W"},{"v":2136,"d":"2136 W"},{"v":2136,"d":"2136 W"},{"v":2136,"d":"2136 W"}]
[null,"P average",{"$f":"C35*2*10^(-C31/10)","v":{"v":1.330822033764274,"d":"1 W"}},{"v":1.330822033764274,"d":"1 W"},{"v":1.330822033764274,"d":"1 W"},{"v":1.330822033764274,"d":"1 W"},{"v":7.9621434110699445E-9,"d":"0 W"},{"v":7.9621434110699445E-9,"d":"0 W"},{"v":7.9621434110699445E-9,"d":"0 W"},{"v":7.9621434110699445E-9,"d":"0 W"},{"$f":"SUM(C39:J39)","v":{"v":5.323288166905671,"d":"5 W"}},{"$f":"IF(K39>0,10*LOG10(O$7/K39),100)","v":{"v":18.301225241850698,"d":"18.3 dB"}},{"$f":"IF(L39<-0.01,CONCATENATE(\"The sustainable total average power is limited to \",O7,\" W\"),\"\")","v":""},"Pidle",{"$f":"INDEX(P39:Z39,1,MATCH(C$9,P$2:Z$2,0))","v":{"v":32.4,"d":"32 W"}},{"v":15.5,"d":"15.5 W"},{"v":19.5,"d":"19.5 W"},{"v":34,"d":"34.0 W"},{"v":32.4,"d":"32.4 W"},{"v":32.4,"d":"32.4 W"},{"v":32.4,"d":"32.4 W"},{"v":34,"d":"34.0 W"},{"v":32.4,"d":"32.4 W"},{"v":32.4,"d":"32.4 W"},{"v":180,"d":"180 W"},{"v":180,"d":"180 W"},null,"HF","0,5 - 2 ms","8 - 32 ms","0,15 - 0,3 sec","0,3 - 0,8 sec"]
[null,"Peak voltage",{"$f":"SQRT(C35*2*C42)","v":{"v":32,"d":"32 Vpk"}},{"$f":"SQRT(D35*2*D42)","v":{"v":32,"d":"32 Vpk"}},{"v":32,"d":"32 Vpk"},{"v":32,"d":"32 Vpk"},{"v":0.044721359549995794,"d":"0 Vpk"},{"v":0.044721359549995794,"d":"0 Vpk"},{"v":0.044721359549995794,"d":"0 Vpk"},{"v":0.044721359549995794,"d":"0 Vpk"},{"$f":"MAX(C40:J40)","v":{"v":32,"d":"32 Vpk"}},null,null,"PF",{"$f":"INDEX(P40:Z40,1,MATCH(C$9,P$2:Z$2,0))","v":0.82},0.91,0.91,0.9,0.82,0.82,0.82,0.9,0.82,0.82,{"$f":"2075/(115*32)","v":{"v":0.563858695652174,"d":"0.56"}},0.56,null,"FR","2 - 8 ms","16 - 64 ms","0,3 - 0,8 sec","0,5 - 2 sec"]
[null,"Peak current",{"$f":"SQRT(C35*2/C43)","v":{"v":2.290393337255473,"d":"2 Apk"}},{"v":2.290393337255473,"d":"2 Apk"},{"v":2.290393337255473,"d":"2 Apk"},{"v":2.290393337255473,"d":"2 Apk"},{"$f":"SQRT(G35*2/G43)","v":{"v":5.1639089432829867E-6,"d":"0 Apk"}},{"$f":"SQRT(H35*2/H43)","v":{"v":5.1639089432829867E-6,"d":"0 Apk"}},{"v":5.1639089432829867E-6,"d":"0 Apk"},{"v":5.1639089432829867E-6,"d":"0 Apk"}]
[null,"Z",{"$f":"IF(IF(C14=$G2,C28/C16,IF(C14=$G6,10000,INDEX($H2:$H6,MATCH(C14,$G2:$G6,0),1)^2/2/C35))>=2,IF(C14=$G2,C28/C16,IF(C14=$G6,10000,INDEX($H2:$H6,MATCH(C14,$G2:$G6,0),1)^2/2/C35)),NA())","v":{"v":16,"d":"16.0 ohm"}},{"v":16,"d":"16.0 ohm"},{"v":16,"d":"16.0 ohm"},{"v":16,"d":"16.0 ohm"},{"v":10000,"d":"10000.0 ohm"},{"v":10000,"d":"10000.0 ohm"},{"v":10000,"d":"10000.0 ohm"},{"v":10000,"d":"10000.0 ohm"},null,null,"Overall impedance","P app. mains max",{"$f":"INDEX(P42:Z42,1,MATCH(C$9,P$2:Z$2,0))","v":{"v":804.8780487804878,"d":"805 VA"}},{"$f":"P12/P40*1.2","v":{"v":118.68131868131866,"d":"119 VA"}},{"v":168.79120879120876,"d":"169 VA"},{"v":1599.9999999999998,"d":"1600 VA"},{"v":1609.7560975609756,"d":"1610 VA"},{"v":965.8536585365853,"d":"966 VA"},{"v":804.8780487804878,"d":"805 VA"},{"v":1599.9999999999998,"d":"1600 VA"},{"v":1609.7560975609756,"d":"1610 VA"},{"v":804.8780487804878,"d":"805 VA"},{"v":3671.1325301204815,"d":"3671 VA"},{"v":10714.285714285712,"d":"10714 VA"}]
[null,"Z min",{"$f":"IF(RIGHT(C14,1)=\"V\",C42*0.85+0.4,C42*0.75+0.2)","v":{"v":12.2,"d":"12.2 ohm"}},{"v":12.2,"d":"12.2 ohm"},{"v":12.2,"d":"12.2 ohm"},{"v":12.2,"d":"12.2 ohm"},{"v":7500.2,"d":"7500.2 ohm"},{"v":7500.2,"d":"7500.2 ohm"},{"v":7500.2,"d":"7500.2 ohm"},{"v":7500.2,"d":"7500.2 ohm"},null,null,"This is an assumption to try to ensure that there is output current headroom in the impedance dips.",null,{"$f":"INDEX(P43:Z43,1,MATCH(C$9,P$2:Z$2,0))","v":{"v":7.5,"d":"8 Arms"}},{"v":4.5,"d":"5 Arms"},{"v":4.5,"d":"5 Arms"},{"v":15,"d":"15 Arms"},{"v":15,"d":"15 Arms"},{"v":7.5,"d":"7.5 Arms"},{"v":7.5,"d":"7.5 Arms"},{"v":15,"d":"15.0 Arms"},{"v":15,"d":"15 Arms"},{"v":7.5,"d":"7.5 Arms"},{"v":32,"d":"32 Arms"},{"v":32,"d":"32.0 Arms"}]
[]
[null,"Headroom",{"$f":"MIN(20*LOG10(1/MAX(C$41/$O$11,C$40/$O$10)),10*LOG10($O$8/C$35))","v":{"v":2.566369545193611,"d":"2.6 dB"}},{"v":2.566369545193611,"d":"2.6 dB"},{"v":2.566369545193611,"d":"2.6 dB"},{"v":2.566369545193611,"d":"2.6 dB"},{"v":59.65906915495192,"d":"59.7 dB"},{"v":59.65906915495192,"d":"59.7 dB"},{"v":59.65906915495192,"d":"59.7 dB"},{"v":59.65906915495192,"d":"59.7 dB"},{"$nulls":3},"Max Pch 70V",{"$f":"INDEX(P45:Y45,1,MATCH(C$9,P$2:Y$2,0))","v":{"v":1100,"d":"1100 W"}},{"v":320,"d":"320 W"},{"v":600,"d":"600 W"},{"v":2100,"d":"2100 W"},{"v":2100,"d":"2100 W"},{"v":1500,"d":"1500 W"},{"v":1100,"d":"1100 W"},{"v":2000,"d":"2000 W"},{"v":4200,"d":"4200 W"},{"v":2400,"d":"2400 W"},{"v":10000,"d":"10000 W"}]
[null,"Round 1 - Ptot burst limited (hidden from user)",{"$nulls":11},"Max Pch 100V",{"$f":"INDEX(P46:Y46,1,MATCH(C$9,P$2:Y$2,0))","v":{"v":1100,"d":"1100 W"}},{"v":320,"d":"320 W"},{"v":500,"d":"500 W"},{"v":3000,"d":"3000 W"},{"v":2200,"d":"2200 W"},{"v":1700,"d":"1700 W"},{"v":1100,"d":"1100 W"},{"v":2300,"d":"2300 W"},{"v":4200,"d":"4200 W"},{"v":2400,"d":"2400 W"},{"v":10000,"d":"10000 W"}]
[null,"Pburst channel limitation 1",{"$f":"MIN(C35,$O$8)","v":{"v":32,"d":"32 W"}},{"v":32,"d":"32 W"},{"v":32,"d":"32 W"},{"v":32,"d":"32 W"},{"v":1e-07,"d":"0 W"},{"v":1e-07,"d":"0 W"},{"v":1e-07,"d":"0 W"},{"v":1e-07,"d":"0 W"}]
[null,"Pburst ch limit incl Umax",{"$f":"MIN(C47,$O11^2/2/C42)","v":{"v":32,"d":"32 W"}},{"v":32,"d":"32 W"},{"v":32,"d":"32 W"},{"v":32,"d":"32 W"},{"v":1e-07,"d":"0 W"},{"v":1e-07,"d":"0 W"},{"v":1e-07,"d":"0 W"},{"v":1e-07,"d":"0 W"}]
[null,"Pburst ch limit incl Imax",{"$f":"MIN(($O10^2*C43)/2,C48)","v":{"v":32,"d":"32 W"}},{"$f":"MIN(($O10^2*D43)/2,D48)","v":{"v":32,"d":"32 W"}},{"$f":"MIN(($O10^2*E43)/2,E48)","v":{"v":32,"d":"32 W"}},{"$f":"MIN(($O10^2*F43)/2,F48)","v":{"v":32,"d":"32 W"}},{"$f":"MIN(($O10*G43)^2/2/G42,G48)","v":{"v":1e-07,"d":"0 W"}},{"$f":"MIN(($O10*H43)^2/2/H42,H48)","v":{"v":1e-07,"d":"0 W"}},{"$f":"MIN(($O10*I43)^2/2/I42,I48)","v":{"v":1e-07,"d":"0 W"}},{"$f":"MIN(($O10*J43)^2/2/J42,J48)","v":{"v":1e-07,"d":"0 W"}}]
[null,"P burst",{"$f":"IF(C35*10^($L35/10)>$O8,$O8,C35*10^($L35/10))","v":{"v":299.99999906250014,"d":"300 W"}},{"v":299.99999906250014,"d":"300 W"},{"v":299.99999906250014,"d":"300 W"},{"v":299.99999906250014,"d":"300 W"},{"v":9.3749999707031285E-7,"d":"0 W"},{"v":9.3749999707031285E-7,"d":"0 W"},{"v":9.3749999707031285E-7,"d":"0 W"},{"v":9.3749999707031285E-7,"d":"0 W"},{"$f":"SUM(C50:J50)","v":{"v":1200.000000000001,"d":"1200 W"}}]
[null,"Peak voltage",{"$f":"SQRT(C50*C$42*2)","v":{"v":97.97958955823404,"d":"98 Vpk"}},{"$f":"SQRT(D50*D$42*2)","v":{"v":97.97958955823404,"d":"98 Vpk"}},{"v":97.97958955823404,"d":"98 Vpk"},{"v":97.97958955823404,"d":"98 Vpk"},{"v":0.13693063916233744,"d":"0 Vpk"},{"v":0.13693063916233744,"d":"0 Vpk"},{"v":0.13693063916233744,"d":"0 Vpk"},{"v":0.13693063916233744,"d":"0 Vpk"}]
[null,"Peak current",{"$f":"(C51/C$43)","v":{"v":8.031113898215905,"d":"8 Apk"}},{"v":8.031113898215905,"d":"8 Apk"},{"v":8.031113898215905,"d":"8 Apk"},{"v":8.031113898215905,"d":"8 Apk"},{"v":1.8256931703466232E-5,"d":"0 Apk"},{"v":1.8256931703466232E-5,"d":"0 Apk"},{"v":1.8256931703466232E-5,"d":"0 Apk"},{"v":1.8256931703466232E-5,"d":"0 Apk"}]
[null,"Headroom",{"$f":"MIN(20*LOG10(1/MAX(C$51/$O$11,C$52/$O$10)),10*LOG10($O$8/C$50))","v":{"v":3.404647727875514,"d":"3.4 dB"}},{"$f":"MIN(20*LOG10(1/MAX(D$51/$O$11,D$52/$O$10)),10*LOG10($O$8/D$50))","v":{"v":3.404647727875514,"d":"3.4 dB"}},{"$f":"20*LOG10(1/MAX(E51/$O11,E52/$O10))","v":{"v":3.404647727875514,"d":"3.4 dB"}},{"v":3.404647727875514,"d":"3.4 dB"},{"v":60.497347337633826,"d":"60.5 dB"},{"v":60.497347337633826,"d":"60.5 dB"},{"v":60.497347337633826,"d":"60.5 dB"},{"v":60.497347337633826,"d":"60.5 dB"}]
[null,"Round 2 - Per channel limitation (hidden from user)"]
[null,"Factor 2",{"$f":"SQRT(C56/C50)","v":{"v":0.3265986328814007,"d":"0.33"}},{"v":0.3265986328814007,"d":"0.33"},{"v":0.3265986328814007,"d":"0.33"},{"v":0.3265986328814007,"d":"0.33"},{"v":0.3265986328814007,"d":"0.33"},{"v":0.3265986328814007,"d":"0.33"},{"v":0.3265986328814007,"d":"0.33"},{"v":0.3265986328814007,"d":"0.33"},{"$nulls":3},"P of channels that can be increased"]
[null,"P burst",{"$f":"MIN(C50,C49)","v":{"v":32,"d":"32 W"}},{"v":32,"d":"32 W"},{"v":32,"d":"32 W"},{"v":32,"d":"32 W"},{"v":1e-07,"d":"0 W"},{"v":1e-07,"d":"0 W"},{"v":1e-07,"d":"0 W"},{"v":1e-07,"d":"0 W"},{"$f":"SUM(C56:J56)","v":{"v":128.00000039999998,"d":"128 W"}},{"$f":"10*LOG10(O$3/K56)","v":{"v":9.719712750425863,"d":"9.7 dB"}},null,{"$f":"IF(C$55<1,0,C56)+IF(D$55<1,0,D56)+IF(E$55<1,0,E56)+IF(J$55<1,0,J56)","v":{"v":0,"d":"0 W"}}]
[null,"Peak voltage",{"$f":"C51*C$55","v":{"v":31.999999999999996,"d":"32 Vpk"}},{"v":31.999999999999996,"d":"32 Vpk"},{"v":31.999999999999996,"d":"32 Vpk"},{"v":31.999999999999996,"d":"32 Vpk"},{"v":0.044721359549995794,"d":"0 Vpk"},{"v":0.044721359549995794,"d":"0 Vpk"},{"v":0.044721359549995794,"d":"0 Vpk"},{"v":0.044721359549995794,"d":"0 Vpk"},null,{"$f":"K50-K56","v":{"v":1071.999999600001,"d":"1072 W"}},null,{"$f":"IF(C$55<1,0,C35)+IF(D$55<1,0,D35)+IF(E$55<1,0,E35)+IF(J$55<1,0,J35)","v":{"v":0,"d":"0 W"}}]
[null,"Peak current",{"v":2.622950819672131,"d":"3 Apk"},{"v":2.622950819672131,"d":"3 Apk"},{"v":2.622950819672131,"d":"3 Apk"},{"v":2.622950819672131,"d":"3 Apk"},{"v":5.9626889349611727E-6,"d":"0 Apk"},{"v":5.9626889349611727E-6,"d":"0 Apk"},{"v":5.9626889349611727E-6,"d":"0 Apk"},{"v":5.9626889349611727E-6,"d":"0 Apk"},null,{"$f":"IF(N56>0,SQRT((MIN(L57,N58)+N56)/N56),1)","v":{"v":1,"d":"1.00"}},null,{"$f":"N57-N56","v":{"v":0,"d":"0 W"}}]
[null,"Round 3 - Increase the previously decreased channels (hidden from user)"]
[null,"Factor 3",{"$f":"SQRT(C61/C56)","v":{"v":1,"d":"1.00"}},{"v":1,"d":"1.00"},{"v":1,"d":"1.00"},{"v":1,"d":"1.00"},{"v":1,"d":"1.00"},{"v":1,"d":"1.00"},{"v":1,"d":"1.00"},{"v":1,"d":"1.00"}]
[null,"P burst",{"$f":"IF(C56<0,C56,MIN($L58^2*C56,C49))","v":{"v":32,"d":"32 W"}},{"$f":"IF(D56<0,D56,MIN($L58^2*D56,D49))","v":{"v":32,"d":"32 W"}},{"v":32,"d":"32 W"},{"v":32,"d":"32 W"},{"v":1e-07,"d":"0 W"},{"v":1e-07,"d":"0 W"},{"v":1e-07,"d":"0 W"},{"v":1e-07,"d":"0 W"},{"$f":"SUM(C61:J61)","v":{"v":128.00000039999998,"d":"128 W"}},{"$f":"10*LOG10(O$3/K61)","v":{"v":9.719712750425863,"d":"9.7 dB"}},null,{"$f":"IF(C$64>0,C61,0)+IF(D$64>0,D61,0)+IF(E$64>0,E61,0)+IF(J$64>0,J61,0)","v":{"v":96.0000001,"d":"96 W"}},{"$f":"O3-K61","v":{"v":1071.9999996000001,"d":"1072 W"}}]
[null,"Peak voltage",{"$f":"SQRT(C61*C$42*2)","v":{"v":32,"d":"32 Vpk"}},{"$f":"SQRT(D61*D$42*2)","v":{"v":32,"d":"32 Vpk"}},{"v":32,"d":"32 Vpk"},{"v":32,"d":"32 Vpk"},{"v":0.044721359549995794,"d":"0 Vpk"},{"v":0.044721359549995794,"d":"0 Vpk"},{"v":0.044721359549995794,"d":"0 Vpk"},{"v":0.044721359549995794,"d":"0 Vpk"},{"$nulls":3},{"$f":"IF(C65>0,C62,0)+IF(D65>0,D62,0)+IF(E65>0,E62,0)+IF(J65>0,J62,0)","v":{"v":0,"d":"0 W"}}]
[null,"Peak current",{"$f":"C62/C$43","v":{"v":2.6229508196721314,"d":"3 Apk"}},{"v":2.6229508196721314,"d":"3 Apk"},{"v":2.6229508196721314,"d":"3 Apk"},{"v":2.6229508196721314,"d":"3 Apk"},{"v":5.9626889349611736E-6,"d":"0 Apk"},{"v":5.9626889349611736E-6,"d":"0 Apk"},{"v":5.9626889349611736E-6,"d":"0 Apk"},{"v":5.9626889349611736E-6,"d":"0 Apk"},null,{"$f":"IF(N62>0,SQRT((N61+O61)/N61),1)","v":{"v":1,"d":"1.00"}}]
[null,"Headroom",{"$f":"MIN(20*LOG10(1/MAX(C62/$O$11,C63/$O$10)),10*LOG10($O$8/C61))","v":{"v":13.124360478301378,"d":"13.1 dB"}},{"v":13.124360478301378,"d":"13.1 dB"},{"v":13.124360478301378,"d":"13.1 dB"},{"v":13.124360478301378,"d":"13.1 dB"},{"v":70.21706008805968,"d":"70.2 dB"},{"v":70.21706008805968,"d":"70.2 dB"},{"v":70.21706008805968,"d":"70.2 dB"},{"v":70.21706008805968,"d":"70.2 dB"},{"$nulls":3},"Max Ptot 70V",{"$f":"INDEX(P64:Y64,1,MATCH(C$9,P$2:Y$2,0))","v":{"v":1200,"d":"1200 W"}},{"v":320,"d":"320 W"},{"v":600,"d":"600 W"},{"v":8000,"d":"8000 W"},{"v":4800,"d":"4800 W"},{"v":2400,"d":"2400 W"},{"v":1200,"d":"1200 W"},{"v":8000,"d":"8000 W"},{"v":4200,"d":"4200 W"},{"v":2400,"d":"2400 W"},{"v":10000,"d":"10000 W"}]
[null,"Round 4 - Increase the previously decreased channels (hidden from user)",{"$nulls":11},"Max Ptot 100V",{"$f":"INDEX(P65:Y65,1,MATCH(C$9,P$2:Y$2,0))","v":{"v":1200,"d":"1200 W"}},{"v":320,"d":"320 W"},{"v":500,"d":"500 W"},{"v":8000,"d":"8000 W"},{"v":4800,"d":"4800 W"},{"v":2400,"d":"2400 W"},{"v":1200,"d":"1200 W"},{"v":8000,"d":"8000 W"},{"v":4200,"d":"4200 W"},{"v":2400,"d":"2400 W"},{"v":10000,"d":"10000 W"}]
[null,"Factor 4",{"$f":"IF(C64<0,10^(C64/20),IF(C64>0,$L63,1))","v":{"v":1,"d":"1.00"}},{"v":1,"d":"1.00"},{"v":1,"d":"1.00"},{"v":1,"d":"1.00"},{"v":1,"d":"1.00"},{"v":1,"d":"1.00"},{"v":1,"d":"1.00"},{"v":1,"d":"1.00"}]
[null,"Round 5 "]
[]
[null,"Headroom 70V",{"$f":"IF(C$14=\"70V\",10*LOG10($O$45/C$35),\"\")","v":""},{"$f":"IF(D$14=\"70V\",10*LOG10($O$45/D$35),\"\")","v":""},{"$f":"IF(E$14=\"70V\",10*LOG10($O$45/E$35),\"\")","v":""},{"$f":"IF(F$14=\"70V\",10*LOG10($O$45/F$35),\"\")","v":""},{"$nulls":4},{"$f":"IF(AND(C$14:F$14=\"70V\"),10*LOG10($O$64/K$35),$L$35)","v":{"v":9.719712750425863,"d":"9.7 dB"}}]
[null,"Headroom 100V",{"$f":"IF(C$14=\"100V\",10*LOG10($O$46/C$35),\"\")","v":""},{"$f":"IF(D$14=\"100V\",10*LOG10($O$46/D$35),\"\")","v":""},{"$f":"IF(E$14=\"100V\",10*LOG10($O$46/E$35),\"\")","v":""},{"$f":"IF(F$14=\"100V\",10*LOG10($O$46/F$35),\"\")","v":""},{"$nulls":4},{"$f":"IF(AND(C$14:F$14=\"100V\"),10*LOG10($O$65/K$35),$L$35)","v":{"v":9.719712750425863,"d":"9.7 dB"}}]
{"$rows_empty":25}
[null,"P average with maintained CF",{"$f":"10^(C137/10)*C39","v":{"v":1.330822033764274,"d":"1 W"}},{"v":1.330822033764274,"d":"1 W"},{"v":1.330822033764274,"d":"1 W"},{"v":1.330822033764274,"d":"1 W"},{"v":7.9621434110699445E-9,"d":"0 W"},{"v":7.9621434110699445E-9,"d":"0 W"},{"v":7.9621434110699445E-9,"d":"0 W"},{"v":7.9621434110699445E-9,"d":"0 W"},{"$f":"SUM(C96:J96)","v":{"v":5.323288166905671,"d":"5 W"}}]
[null,"P average with equal reduction",{"$f":"10^($L39/10)*C39","v":{"v":89.99999946154114,"d":"90 W"}},{"v":89.99999946154114,"d":"90 W"},{"v":89.99999946154114,"d":"90 W"},{"v":89.99999946154114,"d":"90 W"},{"v":5.3845885064143532E-7,"d":"0 W"},{"v":5.3845885064143532E-7,"d":"0 W"},{"v":5.3845885064143532E-7,"d":"0 W"},{"v":5.3845885064143532E-7,"d":"0 W"},{"$f":"SUM(C97:J97)","v":{"v":359.9999999999999,"d":"360 W"}}]
[null,"P average compromise",{"$f":"AVERAGE(C96,C97)","v":{"v":45.66541074765271,"d":"46 W"}},{"v":45.66541074765271,"d":"46 W"},{"v":45.66541074765271,"d":"46 W"},{"v":45.66541074765271,"d":"46 W"},{"v":2.7321049702625262E-7,"d":"0 W"},{"v":2.7321049702625262E-7,"d":"0 W"},{"v":2.7321049702625262E-7,"d":"0 W"},{"v":2.7321049702625262E-7,"d":"0 W"},{"$f":"SUM(C98:J98)","v":{"v":182.66164408345284,"d":"183 W"}},{"$f":"10*LOG10(O$7/K98)","v":{"v":2.9465513848157694,"d":"2.9 dB"}}]
[null,"P average compromise",{"$f":"MIN(10^($L98/10)*C98,C39)","v":{"v":1.330822033764274,"d":"1 W"}},{"v":1.330822033764274,"d":"1 W"},{"v":1.330822033764274,"d":"1 W"},{"v":1.330822033764274,"d":"1 W"},{"v":7.9621434110699445E-9,"d":"0 W"},{"v":7.9621434110699445E-9,"d":"0 W"},{"v":7.9621434110699445E-9,"d":"0 W"},{"v":7.9621434110699445E-9,"d":"0 W"},{"$f":"SUM(C99:J99)","v":{"v":5.323288166905671,"d":"5 W"}},null,null,{"$f":"IF(C$100<1,0,C99)+IF(D$100<1,0,D99)+IF(E$100<1,0,E99)+IF(J$100<1,0,J99)","v":{"v":3.9924661092549654,"d":"4 W"}}]
[null,"Factor",{"$f":"C99/C39","v":{"v":1,"d":"1.00"}},{"v":1,"d":"1.00"},{"v":1,"d":"1.00"},{"v":1,"d":"1.00"},{"v":1,"d":"1.00"},{"v":1,"d":"1.00"},{"v":1,"d":"1.00"},{"v":1,"d":"1.00"},null,{"$f":"IF(N100>0,(N100+O100)/N100,1)","v":{"v":1,"d":"1.00"}},null,{"$f":"K99-N99","v":{"v":1.330822057650706,"d":"1 W"}},{"$f":"MIN(K39,O7)-K99","v":{"v":0,"d":"0 W"}}]
[{"$nulls":13},"Pidle/ch",{"$f":"O39/O102","v":{"v":8.1,"d":"8 W"}}]
[null,"Possible power from the amplifier","Channel",{"$nulls":7},"Total","Headroom",null,"#channels",{"$f":"INDEX(P102:Z102,1,MATCH(C$9,P$2:Z$2,0))","v":4},4,4,4,4,4,4,4,4,4,4,4]
[null,"P burst",{"$f":"MIN(C61*C$66^2,C49)","v":{"v":32,"d":"32 W"}},{"$f":"MIN(D61*D$66^2,D49)","v":{"v":32,"d":"32 W"}},{"v":32,"d":"32 W"},{"v":32,"d":"32 W"},{"v":1e-07,"d":"0 W"},{"v":1e-07,"d":"0 W"},{"v":1e-07,"d":"0 W"},{"v":1e-07,"d":"0 W"},{"$f":"SUM(C103:J103)","v":{"v":128.00000039999998,"d":"128 W"}},{"$f":"10*LOG10(O$3/K103)","v":{"v":9.719712750425863,"d":"9.7 dB"}},null,{"$f":"IF(C$66<1,0,C103)+IF(D$66<1,0,D103)+IF(E$66<1,0,E103)+IF(J$66<1,0,J103)","v":{"v":96.0000001,"d":"96 W"}}]
[null,"P average",{"$f":"MIN(C39,IF(C100<1,$L100,1)*C99)","v":{"v":1.330822033764274,"d":"1 W"}},{"v":1.330822033764274,"d":"1 W"},{"v":1.330822033764274,"d":"1 W"},{"v":1.330822033764274,"d":"1 W"},{"v":7.9621434110699445E-9,"d":"0 W"},{"v":7.9621434110699445E-9,"d":"0 W"},{"v":7.9621434110699445E-9,"d":"0 W"},{"v":7.9621434110699445E-9,"d":"0 W"},{"$f":"SUM(C104:J104)","v":{"v":5.323288166905671,"d":"5 W"}},{"$f":"10*LOG10(O$7/K104)","v":{"v":18.301225241850698,"d":"18.3 dB"}}]
[null,"RMS voltage without use mains current limit",{"$f":"SQRT(C104*C$42)*10^(C$110/20)","v":{"v":5.059644256269408,"d":"5 W"}},{"v":5.059644256269408,"d":"5 W"},{"v":5.059644256269408,"d":"5 W"},{"v":5.059644256269408,"d":"5 W"},{"v":0.011233497625229582,"d":"0 W"},{"v":0.011233497625229582,"d":"0 W"},{"v":0.011233497625229582,"d":"0 W"},{"v":0.011233497625229582,"d":"0 W"}]
[null,"P average with mains current limit",{"$f":"C39*10^(C138/10)","v":{"v":1.330822033764274,"d":"1.3 W"}},{"v":1.330822033764274,"d":"1.3 W"},{"v":1.330822033764274,"d":"1.3 W"},{"v":1.330822033764274,"d":"1.3 W"},{"v":7.9621434110699445E-9,"d":"0.0 W"},{"v":7.9621434110699445E-9,"d":"0.0 W"},{"v":7.9621434110699445E-9,"d":"0.0 W"},{"v":7.9621434110699445E-9,"d":"0.0 W"},{"$f":"SUM(C106:J106)","v":{"v":5.323288166905671,"d":"5 W"}},{"$f":"10*LOG10(K106/K39)","v":{"v":0,"d":"0.0 dB"}}]
[null,"Peak voltage ",{"$f":"C62*C$66","v":{"v":32,"d":"32 Vpk"}},{"$f":"D62*D$66","v":{"v":32,"d":"32 Vpk"}},{"v":32,"d":"32 Vpk"},{"v":32,"d":"32 Vpk"},{"v":0.044721359549995794,"d":"0 Vpk"},{"v":0.044721359549995794,"d":"0 Vpk"},{"v":0.044721359549995794,"d":"0 Vpk"},{"v":0.044721359549995794,"d":"0 Vpk"},{"$f":"MAX(C107:J107)","v":{"v":32,"d":"32.0 Vpk"}},{"$f":"K61-K103","v":{"v":0,"d":"0 W"}},null,{"$f":"IF(C$66<1,0,C35)+IF(D$66<1,0,D35)+IF(E$66<1,0,E35)+IF(J$66<1,0,J35)","v":{"v":96.0000001,"d":"96 W"}}]
[null,"RMS voltage",{"$f":"SQRT(C106*C$42)*10^(C$110/20)","v":{"v":5.059644256269408,"d":"5 Vpk"}},{"v":5.059644256269408,"d":"5 Vpk"},{"v":5.059644256269408,"d":"5 Vpk"},{"v":5.059644256269408,"d":"5 Vpk"},{"v":0.011233497625229582,"d":"0 Vpk"},{"v":0.011233497625229582,"d":"0 Vpk"},{"v":0.011233497625229582,"d":"0 Vpk"},{"v":0.011233497625229582,"d":"0 Vpk"},null,{"$f":"SQRT(E133*2*E40)","v":25.981364118470044}]
[null,"Desired crest factor",{"$f":"-INDEX($AD$22:$AD$27,MATCH(C$30,$AB$22:$AB$27,0),1)","v":{"v":-16.02059991327962,"d":"-16.0 dB"}},{"v":-16.02059991327962,"d":"-16.0 dB"},{"v":-16.02059991327962,"d":"-16.0 dB"},{"v":-16.02059991327962,"d":"-16.0 dB"},{"v":-12,"d":"-12.0 dB"},{"v":-12,"d":"-12.0 dB"},{"v":-12,"d":"-12.0 dB"},{"v":-12,"d":"-12.0 dB"},null,{"$f":"SQRT(E134*2*E42)","v":32}]
[null,"Difference between average power and average voltage",{"$f":"C31+C109","v":{"v":0.8000000000000007,"d":"0.8 dB"}},{"$f":"D31+D109","v":{"v":0.8000000000000007,"d":"0.8 dB"}},{"v":0.8000000000000007,"d":"0.8 dB"},{"v":0.8000000000000007,"d":"0.8 dB"},{"v":2,"d":"2.0 dB"},{"v":2,"d":"2.0 dB"},{"v":2,"d":"2.0 dB"},{"v":2,"d":"2.0 dB"}]
[null,"Peak current ",{"$f":"C63*C$66","v":{"v":2.6229508196721314,"d":"3 Apk"}},{"v":2.6229508196721314,"d":"3 Apk"},{"v":2.6229508196721314,"d":"3 Apk"},{"v":2.6229508196721314,"d":"3 Apk"},{"v":5.9626889349611736E-6,"d":"0 Apk"},{"v":5.9626889349611736E-6,"d":"0 Apk"},{"v":5.9626889349611736E-6,"d":"0 Apk"},{"v":5.9626889349611736E-6,"d":"0 Apk"},null,{"$f":"(MIN(L107,N111)+N103)/N103","v":{"v":1,"d":"1.00"}},null,{"$f":"N107-N103","v":{"v":0,"d":"0 W"}},{"$nulls":28},{"$f":"C111+D111+E111+F111","v":{"v":10.491803278688526,"d":"10 Apk"}}]
[null,{"$f":"IF(LEN($C9)>9,\"Set dipswitch to\",\"\")","v":"Set dipswitch to"},{"$f":"IF(LEN($B112)<1,\"\",IF(DipSwitchOverride($C$9,C$13)=\"\",IF(C14=$G2,IF(C107<=$O9,\"Lo-Z\",IF(C107>100,$G3,$G4)),C14),DipSwitchOverride($C$9,C$13)))","v":"Lo-Z"},{"$f":"IF(LEN($B112)<1,\"\",IF(DipSwitchOverride($C$9,D$13)=\"\",IF(D14=$G2,IF(D107<=$O9,\"Lo-Z\",IF(D107>100,$G3,$G4)),D14),DipSwitchOverride($C$9,D$13)))","v":"Lo-Z"},{"$f":"IF(LEN($B112)<1,\"\",IF(DipSwitchOverride($C$9,E$13)=\"\",IF(E14=$G2,IF(E107<=$O9,\"Lo-Z\",IF(E107>100,$G3,$G4)),E14),DipSwitchOverride($C$9,E$13)))","v":"Lo-Z"},{"$f":"IF(LEN($B112)<1,\"\",IF(DipSwitchOverride($C$9,F$13)=\"\",IF(F14=$G2,IF(F107<=$O9,\"Lo-Z\",IF(F107>100,$G3,$G4)),F14),DipSwitchOverride($C$9,F$13)))","v":"Lo-Z"},{"$f":"IF(LEN($B112)<1,\"\",IF(G14=$G2,IF(G107<$O9,\"Lo-Z\",IF(G107>100,$G3,$G4)),G14))","v":"Unused"},{"$f":"IF(LEN($B112)<1,\"\",IF(H14=$G2,IF(H107<$O9,\"Lo-Z\",IF(H107>100,$G3,$G4)),H14))","v":"Unused"},{"$f":"IF(LEN($B112)<1,\"\",IF(I14=$G2,IF(I107<$O9,\"Lo-Z\",IF(I107>100,$G3,$G4)),I14))","v":"Unused"},{"$f":"IF(LEN($B112)<1,\"\",IF(J14=$G2,IF(J107<$O9,\"Lo-Z\",IF(J107>100,$G3,$G4)),J14))","v":"Unused"},null,null,"Dipswitch setting on rear panel of amplifier. AMM112 FR, LF on PSX1204D, PSX2404D 100V     \n dipswitch reccomended. "]
[]
[null,"X series Channel/Rail Limitation"]
[null,"Peak current requested",{"$f":"C$41","v":{"v":2.290393337255473,"d":"2 Apk"}},{"$f":"D$41","v":{"v":2.290393337255473,"d":"2 Apk"}},{"v":2.290393337255473,"d":"2 Apk"},{"v":2.290393337255473,"d":"2 Apk"},{"v":5.1639089432829867E-6,"d":"0 Apk"},{"v":5.1639089432829867E-6,"d":"0 Apk"},{"v":5.1639089432829867E-6,"d":"0 Apk"},{"v":5.1639089432829867E-6,"d":"0 Apk"}]
[null,"Delta Voltage",{"$f":"IF($C$9=\"X4L\",C$115*0.25*2,IF($C$9=\"X4\",C$115*0.25,0))","v":{"v":0,"d":"0 V"}},{"v":0,"d":"0 V"},{"v":0,"d":"0 V"},{"v":0,"d":"0 V"},{"v":0,"d":"0 V"},{"v":0,"d":"0 V"},{"v":0,"d":"0 V"},{"v":0,"d":"0 V"}]
[null,"Max Vpk Channel limited",{"$f":"IF($C$9=\"X4L\",300-C$116,IF($C$9=\"X4\",175-C$116,$O$11))","v":{"v":145,"d":"145 Vpk"}},{"v":145,"d":"145 Vpk"},{"v":145,"d":"145 Vpk"},{"v":145,"d":"145 Vpk"},{"v":145,"d":"145 Vpk"},{"v":145,"d":"145 Vpk"},{"v":145,"d":"145 Vpk"},{"v":145,"d":"145 Vpk"}]
[null,"Headroom",{"$f":"IF(OR($C9=\"X4\",$C9=\"X4L\",$C9=\"X8\"),10*LOG10(C$117/C$40),35)","v":{"v":35,"d":"35.0 dB"}},{"v":35,"d":"35.0 dB"},{"v":35,"d":"35.0 dB"},{"v":35,"d":"35.0 dB"},{"v":35,"d":"35.0 dB"},{"v":35,"d":"35.0 dB"},{"v":35,"d":"35.0 dB"},{"v":35,"d":"35.0 dB"}]
[]
[null,"Possible vs desired (average)",{"$f":"10*LOG10(C104/C39)","v":{"v":0,"d":"0.0 dB"}},{"v":0,"d":"0.0 dB"},{"v":0,"d":"0.0 dB"},{"v":0,"d":"0.0 dB"},{"v":0,"d":"0.0 dB"},{"v":0,"d":"0.0 dB"},{"v":0,"d":"0.0 dB"},{"v":0,"d":"0.0 dB"},null,{"$f":"MIN(C120:J120)","v":{"v":0,"d":"0.0 dB"}},null,"8 ohm P out",{"$nulls":11},{"$f":"1600","v":{"v":1600,"d":"1600 W"}}]
[null,"Crest factor possible",{"$f":"10*LOG10(2*C103/C104)","v":{"v":16.820599913279622,"d":"17 dB"}},{"v":16.820599913279622,"d":"17 dB"},{"v":16.820599913279622,"d":"17 dB"},{"v":16.820599913279622,"d":"17 dB"},{"v":14,"d":"14 dB"},{"v":14,"d":"14 dB"},{"v":14,"d":"14 dB"},{"v":14,"d":"14 dB"},{"$nulls":3},"8 ohm BTU",{"$nulls":11},2117]
[null,"Crest factor headroom",{"$f":"C31-C121","v":{"v":0,"d":"0 dB"}},{"v":0,"d":"0 dB"},{"v":0,"d":"0 dB"},{"v":0,"d":"0 dB"},{"v":0,"d":"0 dB"},{"v":0,"d":"0 dB"},{"v":0,"d":"0 dB"},{"v":0,"d":"0 dB"},{"$nulls":3},"8 ohm P in",{"$nulls":11},{"$f":"1/3.412142*Z120+Z120","v":{"v":2068.9136618581524,"d":"2069 W"}}]
[null,"Current draw and thermal dissipation",{"$nulls":11},"N eff 8 ohm",{"$nulls":11},{"$f":"Z120/(Z122-Z39)","v":0.8470477144127679}]
[null,"Automatic settings"]
[null,"P ch fast",{"$f":"MIN(C103*1.4,$O28)","v":{"v":44.8,"d":"45 W"}},{"v":44.8,"d":"45 W"},{"v":44.8,"d":"45 W"},{"v":44.8,"d":"45 W"},{"v":1.3999999999999998E-7,"d":"0 W"},{"v":1.3999999999999998E-7,"d":"0 W"},{"v":1.3999999999999998E-7,"d":"0 W"},{"v":1.3999999999999998E-7,"d":"0 W"},{"$f":"SUM(C125:J125)","v":{"v":179.20000055999998,"d":"179 W"}},{"$f":"-10*LOG10(K103/K125)","v":{"v":1.4612803567823809,"d":"1.5 dB"}},null,"4 ohm BTU"]
[null,"P ch slow",{"$f":"MIN(C104*2,$O29)","v":{"v":2.661644067528548,"d":"3 W"}},{"v":2.661644067528548,"d":"3 W"},{"v":2.661644067528548,"d":"3 W"},{"v":2.661644067528548,"d":"3 W"},{"v":1.5924286822139889E-8,"d":"0 W"},{"v":1.5924286822139889E-8,"d":"0 W"},{"v":1.5924286822139889E-8,"d":"0 W"},{"v":1.5924286822139889E-8,"d":"0 W"},{"$f":"SUM(C126:J126)","v":{"v":10.646576333811343,"d":"11 W"}}]
[null,"P mains slow",{"$nulls":8},{"$f":"MIN(K130*1.4,O$12)","v":{"v":59.06523712744573,"d":"59 W"}},null,null,{"$f":"10*LOG10(K104/K126)","v":{"v":-3.010299956639812,"d":"-3.0 dB"}}]
[null,"Estimated net efficiency",{"$f":"IF(C$14=\"Unused\",0,C107*$O33+$O34)","v":{"v":0.5437777777777778,"d":"54.4%"}},{"v":0.5437777777777778,"d":"54.4%"},{"v":0.5437777777777778,"d":"54.4%"},{"v":0.5437777777777778,"d":"54.4%"},{"v":0,"d":"0.0%"},{"v":0,"d":"0.0%"},{"v":0,"d":"0.0%"},{"v":0,"d":"0.0%"},{"$f":"K104/(K130-O39)","v":{"v":0.5437777810311331,"d":"54.4%"}}]
[null,"P mains worst case",{"$f":"IF(C$14=\"Unused\",0,C126/C$128+$O$101)","v":{"v":12.994727545516332,"d":"13 W"}},{"v":12.994727545516332,"d":"13 W"},{"v":12.994727545516332,"d":"13 W"},{"v":12.994727545516332,"d":"13 W"},{"v":0,"d":"0 W"},{"v":0,"d":"0 W"},{"v":0,"d":"0 W"},{"v":0,"d":"0 W"},{"$f":"SUM(C129:J129)","v":{"v":51.97891018206533,"d":"52 W"}},{"$f":"10*LOG10(O$12/K129)","v":{"v":10.24535519886715,"d":"10.2 dB"}}]
[null,"P mains estimated",{"$f":"IF(C$14=\"Unused\",0,C104/C$128+$O$101)","v":{"v":10.547363772758166,"d":"11 W"}},{"v":10.547363772758166,"d":"11 W"},{"v":10.547363772758166,"d":"11 W"},{"v":10.547363772758166,"d":"11 W"},{"v":0,"d":"0 W"},{"v":0,"d":"0 W"},{"v":0,"d":"0 W"},{"v":0,"d":"0 W"},{"$f":"SUM(C130:J130)","v":{"v":42.18945509103266,"d":"42 W"}},{"$f":"10*LOG10(O$12/K130)","v":{"v":11.151587733203721,"d":"11.2 dB"}}]
[null,"I mains estimated",{"$nulls":8},{"$f":"K130/O40/C10","v":{"v":0.4473961303396889,"d":"0.4 Arms"}}]
[null,"I mains limited to",{"$nulls":8},{"$f":"MIN(MIN(O42,K130)/O40/$C10,O43,$E10)","v":{"v":0.4473961303396889,"d":"0.4 Arms"}},{"$f":"-10*LOG10(K132/O43)","v":{"v":12.243690399551568,"d":"12.2 dB"}},null,"4ohm BTU",{"$nulls":11},3892]
[null,"P mains possible",{"$f":"((C130-$O101)/($K130-$O39))*($K133-$O39)+$O101","v":{"v":10.547363772758166,"d":"11 W"}},{"v":10.547363772758166,"d":"11 W"},{"v":10.547363772758166,"d":"11 W"},{"v":10.547363772758166,"d":"11 W"},{"v":0,"d":"0 W"},{"v":0,"d":"0 W"},{"v":0,"d":"0 W"},{"v":0,"d":"0 W"},{"$f":"K132*$C10*O40","v":{"v":42.18945509103266,"d":"42 W"}},null,null,"1/4th power",{"$nulls":11},{"$f":"SQRT(Z135/8*8*8*2)","v":226.27416997969522}]
[null,"Pout possible (burst with the same CF)",{"$f":"C35/C39*C135","v":{"v":32,"d":"32 W"}},{"v":32,"d":"32 W"},{"v":32,"d":"32 W"},{"v":32,"d":"32 W"},{"v":0,"d":"0 W"},{"v":0,"d":"0 W"},{"v":0,"d":"0 W"},{"v":0,"d":"0 W"},{"$f":"SUM($C134:J134)","v":{"v":128,"d":"128 W"}}]
[null,"P out possible (average)",{"$f":"(C133-$O101)*C128","v":{"v":1.330822033764274,"d":"1 W"}},{"v":1.330822033764274,"d":"1 W"},{"v":1.330822033764274,"d":"1 W"},{"v":1.330822033764274,"d":"1 W"},{"v":0,"d":"0 W"},{"v":0,"d":"0 W"},{"v":0,"d":"0 W"},{"v":0,"d":"0 W"},{"$f":"SUM($C135:J135)","v":{"v":5.323288135057096,"d":"5 W"}},null,null,"Pout 4 ohm",null,{"v":500,"d":"500 W"},{"v":1000,"d":"1000 W"},{"v":2400,"d":"2400 W"},{"v":1500,"d":"1500 W"},{"v":800,"d":"800 W"},{"v":400,"d":"400 W"},{"v":2000,"d":"2000 W"},{"v":1250,"d":"1250 W"},{"v":750,"d":"750 W"},{"v":3000,"d":"3000 W"},{"$f":"1600/4*8","v":{"v":3200,"d":"3200 W"}}]
[null,"Crest factor extension",{"$f":"C137-C138","v":{"v":0,"d":"0 dB"}},{"$f":"D137-D138","v":{"v":0,"d":"0 dB"}},{"v":0,"d":"0 dB"},{"v":0,"d":"0 dB"},{"v":0,"d":"0 dB"},{"v":0,"d":"0 dB"},{"v":0,"d":"0 dB"},{"v":0,"d":"0 dB"},{"$f":"MAX($C136:F136)","v":{"v":0,"d":"0 dB"}}]
[null,"Gain reduction (burst)",{"$f":"10*LOG10(C103/C35)","v":{"v":0,"d":"0.0 dB"}},{"$f":"10*LOG10(D103/D35)","v":{"v":0,"d":"0.0 dB"}},{"v":0,"d":"0.0 dB"},{"v":0,"d":"0.0 dB"},{"v":0,"d":"0.0 dB"},{"v":0,"d":"0.0 dB"},{"v":0,"d":"0.0 dB"},{"v":0,"d":"0.0 dB"},{"$f":"MIN(C137:J137)","v":{"v":0,"d":"0.0 dB"}},null,null,"1/8th power, Vpk",{"$nulls":11},{"$f":"SQRT(Z120/8*8*8*2)","v":160}]
[null,"Gain reduction (average)",{"$f":"IF(C$14=\"Unused\",0,10*LOG10(C135/C39))","v":{"v":0,"d":"0.0 dB"}},{"v":0,"d":"0.0 dB"},{"v":0,"d":"0.0 dB"},{"v":0,"d":"0.0 dB"},{"v":0,"d":"0.0 dB"},{"v":0,"d":"0.0 dB"},{"v":0,"d":"0.0 dB"},{"v":0,"d":"0.0 dB"},{"$f":"10*LOG10(K135/K39)","v":{"v":-2.5983302213723157E-8,"d":"-0.0 dB"}},null,null,"BTU",{"$nulls":3},1713,760,360,261,{"$nulls":4},3892]
[null,"Headroom",{"$f":"IF(C$14=\"70V\",MIN($K$71,C$71),IF(C$14=\"100V\",MIN($K$70,C$70),IF(C$14=\"Unused\",\"Unused\",IF(C$14=\"Lo-Z\",MIN(20*LOG10(MAX($O9,$O30)/C40),20*LOG10(1/MAX(C$57/$O11,C$58/$O10)),10*LOG10($O8/C$56),$L$35,C$118,IF(C137<-0.01,C137,32),IF(C138<-0.01,C138,32)),MIN(20*LOG10(1/(C$58/$O10)),10*LOG10($O8/C$56),$L$35,IF(C137<-0.01,C137,32),IF(C138<-0.01,C138,32))))))","v":{"v":9.719712750425863,"d":"9.7 dB"}},{"$f":"IF(D$14=\"70V\",MIN($K$71,D$71),IF(D$14=\"100V\",MIN($K$70,D$70),IF(D$14=\"Unused\",\"Unused\",IF(D$14=\"Lo-Z\",MIN(20*LOG10(MAX($O9,$O30)/D40),20*LOG10(1/MAX(D$57/$O11,D$58/$O10)),10*LOG10($O8/D$56),$L$35,D$118,IF(D137<-0.01,D137,32),IF(D138<-0.01,D138,32)),MIN(20*LOG10(1/(D$58/$O10)),10*LOG10($O8/D$56),$L$35,IF(D137<-0.01,D137,32),IF(D138<-0.01,D138,32))))))","v":{"v":9.719712750425863,"d":"9.7 dB"}},{"$f":"IF(E$14=\"70V\",MIN($K$71,E$71),IF(E$14=\"100V\",MIN($K$70,E$70),IF(E$14=\"Unused\",\"Unused\",IF(E$14=\"Lo-Z\",MIN(20*LOG10(MAX($O9,$O30)/E40),20*LOG10(1/MAX(E$57/$O11,E$58/$O10)),10*LOG10($O8/E$56),$L$35,E$118,IF(E137<-0.01,E137,32),IF(E138<-0.01,E138,32)),MIN(20*LOG10(1/(E$58/$O10)),10*LOG10($O8/E$56),$L$35,IF(E137<-0.01,E137,32),IF(E138<-0.01,E138,32))))))","v":{"v":9.719712750425863,"d":"9.7 dB"}},{"$f":"IF(F$14=\"70V\",MIN($K$71,F$71),IF(F$14=\"100V\",MIN($K$70,F$70),IF(F$14=\"Unused\",\"Unused\",IF(F$14=\"Lo-Z\",MIN(20*LOG10(MAX($O9,$O30)/F40),20*LOG10(1/MAX(F$57/$O11,F$58/$O10)),10*LOG10($O8/F$56),$L$35,F$118,IF(F137<-0.01,F137,32),IF(F138<-0.01,F138,32)),MIN(20*LOG10(1/(F$58/$O10)),10*LOG10($O8/F$56),$L$35,IF(F137<-0.01,F137,32),IF(F138<-0.01,F138,32))))))","v":{"v":9.719712750425863,"d":"9.7 dB"}},{"$f":"IF(G$14=\"Unused\",\"Unused\",IF(G$14=\"Lo-Z\",MIN(20*LOG10(MAX($O9,$O30)/G40),20*LOG10(1/MAX(G$57/$O11,G$58/$O10)),10*LOG10($O8/G$56),$L$35,G$118,IF(G137<-0.01,G137,32),IF(G138<-0.01,G138,32)),MIN(20*LOG10(1/(G$58/$O10)),10*LOG10($O8/G$56),$L$35,IF(G137<-0.01,G137,32),IF(G138<-0.01,G138,32))))","v":"Unused"},{"$f":"IF(H$14=\"Unused\",\"Unused\",IF(H$14=\"Lo-Z\",MIN(20*LOG10(MAX($O9,$O30)/H40),20*LOG10(1/MAX(H$57/$O11,H$58/$O10)),10*LOG10($O8/H$56),$L$35,H$118,IF(H137<-0.01,H137,32),IF(H138<-0.01,H138,32)),MIN(20*LOG10(1/(H$58/$O10)),10*LOG10($O8/H$56),$L$35,IF(H137<-0.01,H137,32),IF(H138<-0.01,H138,32))))","v":"Unused"},{"$f":"IF(I$14=\"Unused\",\"Unused\",IF(I$14=\"Lo-Z\",MIN(20*LOG10(MAX($O9,$O30)/I40),20*LOG10(1/MAX(I$57/$O11,I$58/$O10)),10*LOG10($O8/I$56),$L$35,I$118,IF(I137<-0.01,I137,32),IF(I138<-0.01,I138,32)),MIN(20*LOG10(1/(I$58/$O10)),10*LOG10($O8/I$56),$L$35,IF(I137<-0.01,I137,32),IF(I138<-0.01,I138,32))))","v":"Unused"},{"$f":"IF(J$14=\"Unused\",\"Unused\",IF(J$14=\"Lo-Z\",MIN(20*LOG10(MAX($O9,$O30)/J40),20*LOG10(1/MAX(J$57/$O11,J$58/$O10)),10*LOG10($O8/J$56),$L$35,J$118,IF(J137<-0.01,J137,32),IF(J138<-0.01,J138,32)),MIN(20*LOG10(1/(J$58/$O10)),10*LOG10($O8/J$56),$L$35,IF(J137<-0.01,J137,32),IF(J138<-0.01,J138,32))))","v":"Unused"},null,{"$f":"MIN(C139:F139,L130,L132,L56,L61)","v":{"v":9.719712750425863,"d":"9.7 dB"}},"If this results in +3dB, go down an amp model. If this results in -3dB go up an amp model.",{"$nulls":22},{"$f":"IF(AH137>3,CONCATENATE(\"The capacity to sustain the crest factor is challenged. While individual beats \",IF(AH138>-0.01,\"can \",\"may \"),\"reach the desired peak level, there is an obvious risk that the SPL of the beats will vary over time.\"),\"\")","v":""}]
[null,"P loss",{"$nulls":8},{"$f":"K133-K135","v":{"v":36.866166955975565,"d":"37 W"}},null,null,"P 1/8th in 4 ohm",null,null,{"v":1425,"d":"1425 W"},null,{"v":2075,"d":"2075 W"},{"$nulls":6},{"$f":"1/3.412142*Z132+Z135","v":{"v":4340.632482469956,"d":"4341 W"}}]
[null,"BTU",{"$nulls":8},{"$f":"3.412*K140","v":{"v":125.78736165378862,"d":"126 BTU/h"}},null,null,"N eff 4 ohm",null,null,{"$f":"Q135/(Q140-Q56)","v":{"v":0.7017543859649122,"d":"70.2%"}},{"$f":"R135/(R140-R56)","v":{"$error":"#DIV/0!"}},{"v":0.7228915662650602,"d":"72.3%"},{"$error":"#DIV/0!"},{"$error":"#DIV/0!"},{"$error":"#DIV/0!"},{"$error":"#DIV/0!"},{"$error":"#DIV/0!"},{"$error":"#DIV/0!"},{"$f":"Z135/(Z140-Z56)","v":0.7372197514817241}]
[]
[null,"Apparent power",{"$nulls":8},{"$f":"K132*C10","v":{"v":51.45055498906422,"d":"51 VA"}}]
[{"$nulls":10},{"$f":"K133/K143","v":0.82}]
[null,"PowerSoft Suggested Limiters Treshold"]
[{"$nulls":12},"Values that should be used in the limiter settings if creating custom presets"]
[null,"Clip voltage",{"$f":"IF(C$14=\"Lo-Z\",C$40*1.05,C$40)","v":{"v":33.6,"d":"34 V"}},{"$f":"IF(D$14=\"Lo-Z\",D$40*1.05,D$40)","v":{"v":33.6,"d":"34 V"}},{"$f":"IF(E$14=\"Lo-Z\",E$40*1.05,E$40)","v":{"v":33.6,"d":"34 V"}},{"$f":"IF(F$14=\"Lo-Z\",F$40*1.05,F$40)","v":{"v":33.6,"d":"34 V"}},{"$f":"IF($C14=\"Lo-Z\",G$40*1.05,G$40)","v":{"v":0.046957427527495585,"d":"0 Vpk"}},{"$f":"IF($C14=\"Lo-Z\",H$40*1.05,H$40)","v":{"v":0.046957427527495585,"d":"0 Vpk"}},{"$f":"IF($C14=\"Lo-Z\",I$40*1.05,I$40)","v":{"v":0.046957427527495585,"d":"0 Vpk"}},{"$f":"IF($C14=\"Lo-Z\",J$40*1.05,J$40)","v":{"v":0.046957427527495585,"d":"0 Vpk"}}]
[]
[null,"Peak voltage ",{"$f":"C$40*0.8","v":{"v":25.6,"d":"26 V"}},{"v":25.6,"d":"26 V"},{"v":25.6,"d":"26 V"},{"v":25.6,"d":"26 V"},{"v":0.03577708763999664,"d":"0 Vpk"},{"v":0.03577708763999664,"d":"0 Vpk"},{"v":0.03577708763999664,"d":"0 Vpk"},{"v":0.03577708763999664,"d":"0 Vpk"},null,null,{"$f":"IF(K180<-0.01,\"A peak limiter setting above this level may lead to undesireable artefacts in percussive sounds\",\"\")","v":""},{"$nulls":18},{"$f":"IF(C$66<1,0,C73)+IF(D$66<1,0,D73)+IF(E$66<1,0,E73)+IF(F$66<1,0,F73)","v":{"v":0,"d":"0 W"}}]
[null,"Attack Time Range",{"$f":"VLOOKUP(C$30,$AB33:$AF40,2,FALSE)","v":"2 - 8 ms"},{"$f":"VLOOKUP(D$30,$AB33:$AF40,2,FALSE)","v":"2 - 8 ms"},{"$f":"VLOOKUP(E$30,$AB33:$AF40,2,FALSE)","v":"2 - 8 ms"},{"$f":"VLOOKUP(F$30,$AB33:$AF40,2,FALSE)","v":"2 - 8 ms"},{"$f":"VLOOKUP($C30,$AB33:$AF40,2,FALSE)","v":"2 - 8 ms"},{"$f":"VLOOKUP($C30,$AB33:$AF40,2,FALSE)","v":"2 - 8 ms"},{"$f":"VLOOKUP($C30,$AB33:$AF40,2,FALSE)","v":"2 - 8 ms"},{"$f":"VLOOKUP($C30,$AB33:$AF40,2,FALSE)","v":"2 - 8 ms"}]
[null,"Release Time Range",{"$f":"VLOOKUP(C$30,$AB33:$AF40,3,FALSE)","v":"16 - 64 ms"},{"$f":"VLOOKUP(D$30,$AB33:$AF40,3,FALSE)","v":"16 - 64 ms"},{"$f":"VLOOKUP(E$30,$AB33:$AF40,3,FALSE)","v":"16 - 64 ms"},{"$f":"VLOOKUP(F$30,$AB33:$AF40,3,FALSE)","v":"16 - 64 ms"},{"$f":"VLOOKUP($C30,$AB33:$AF40,3,FALSE)","v":"16 - 64 ms"},{"$f":"VLOOKUP($C30,$AB33:$AF40,3,FALSE)","v":"16 - 64 ms"},{"$f":"VLOOKUP($C30,$AB33:$AF40,3,FALSE)","v":"16 - 64 ms"},{"$f":"VLOOKUP($C30,$AB33:$AF40,3,FALSE)","v":"16 - 64 ms"}]
[]
[null,"RMS voltage",{"$f":"SQRT(C$35/2*C$42)*VLOOKUP(C$30,$AB22:$AF27,5,FALSE)","v":{"v":9.6,"d":"10 V"}},{"$f":"SQRT(D$35/2*D$42)*VLOOKUP(D$30,$AB22:$AF27,5,FALSE)","v":{"v":9.6,"d":"10 V"}},{"$f":"SQRT(E$35/2*E$42)*VLOOKUP(E$30,$AB22:$AF27,5,FALSE)","v":{"v":9.6,"d":"10 V"}},{"$f":"SQRT(F$35/2*F$42)*VLOOKUP(F$30,$AB22:$AF27,5,FALSE)","v":{"v":9.6,"d":"10 V"}},{"$f":"SQRT(G$35/2*G$42)*VLOOKUP($C30,$AB22:$AF27,5,FALSE)","v":{"v":0.013416407864998738,"d":"0 Vpk"}},{"$f":"SQRT(H$35/2*H$42)*VLOOKUP($C30,$AB22:$AF27,5,FALSE)","v":{"v":0.013416407864998738,"d":"0 Vpk"}},{"$f":"SQRT(I$35/2*I$42)*VLOOKUP($C30,$AB22:$AF27,5,FALSE)","v":{"v":0.013416407864998738,"d":"0 Vpk"}},{"$f":"SQRT(J$35/2*J$42)*VLOOKUP($C30,$AB22:$AF27,5,FALSE)","v":{"v":0.013416407864998738,"d":"0 Vpk"}},null,null,{"$f":"IF(K181<-0.01,\"An rms limiter setting above this level may lead to undesireable pumping effects\",\"\")","v":""}]
[null,"Desired crest factor",{"$f":"-INDEX($AM$12:$AM$29,MATCH(C$30,$AK$12:$AK$29,0),1)","v":{"$error":"#N/A"}},{"$error":"#N/A"},{"$error":"#N/A"},{"$error":"#N/A"},{"$error":"#N/A"},{"$error":"#N/A"},{"$error":"#N/A"},{"$error":"#N/A"}]
[null,"Difference between average power and average voltage",{"$f":"C69+C154","v":{"$error":"#VALUE!"}},{"$f":"D69+D154","v":{"$error":"#VALUE!"}},{"$error":"#VALUE!"},{"$error":"#VALUE!"},{"$error":"#N/A"},{"$error":"#N/A"},{"$error":"#N/A"},{"$error":"#N/A"}]
[null,"Peak current ",{"$f":"C95*C$66","v":{"v":0,"d":"0.0 Apk"}},{"v":0,"d":"0.0 Apk"},{"v":0,"d":"0.0 Apk"},{"v":0,"d":"0.0 Apk"},{"v":0,"d":"0.0 Apk"},{"v":0,"d":"0.0 Apk"},{"v":0,"d":"0.0 Apk"},{"v":0,"d":"0.0 Apk"},null,{"$f":"(MIN(M149,AF156)+AF176)/AF176","v":{"$error":"#DIV/0!"}},{"$nulls":19},{"$f":"AF149-AF176","v":{"v":0,"d":"0 W"}}]
[null,"Attack Time Range",{"$f":"VLOOKUP(C$30,$AB33:$AF40,4,FALSE)","v":"0,3 - 0,8 sec"},{"$f":"VLOOKUP(D$30,$AB33:$AF40,4,FALSE)","v":"0,3 - 0,8 sec"},{"$f":"VLOOKUP(E$30,$AB33:$AF40,4,FALSE)","v":"0,3 - 0,8 sec"},{"$f":"VLOOKUP(F$30,$AB33:$AF40,4,FALSE)","v":"0,3 - 0,8 sec"},{"$f":"VLOOKUP($C30,$AB33:$AF40,4,FALSE)","v":"0,3 - 0,8 sec"},{"$f":"VLOOKUP($C30,$AB33:$AF40,4,FALSE)","v":"0,3 - 0,8 sec"},{"$f":"VLOOKUP($C30,$AB33:$AF40,4,FALSE)","v":"0,3 - 0,8 sec"},{"$f":"VLOOKUP($C30,$AB33:$AF40,4,FALSE)","v":"0,3 - 0,8 sec"}]
[null,"Release Time Range",{"$f":"VLOOKUP(C$30,$AB33:$AF40,5,FALSE)","v":"0,5 - 2 sec"},{"$f":"VLOOKUP(D$30,$AB33:$AF40,5,FALSE)","v":"0,5 - 2 sec"},{"$f":"VLOOKUP(E$30,$AB33:$AF40,5,FALSE)","v":"0,5 - 2 sec"},{"$f":"VLOOKUP(F$30,$AB33:$AF40,5,FALSE)","v":"0,5 - 2 sec"},{"$f":"VLOOKUP($C30,$AB33:$AF40,5,FALSE)","v":"0,5 - 2 sec"},{"$f":"VLOOKUP($C30,$AB33:$AF40,5,FALSE)","v":"0,5 - 2 sec"},{"$f":"VLOOKUP($C30,$AB33:$AF40,5,FALSE)","v":"0,5 - 2 sec"},{"$f":"VLOOKUP($C30,$AB33:$AF40,5,FALSE)","v":"0,5 - 2 sec"}]
[]
[null,"Bose EQ preset Treshold"]
[null,"Peak Voltage",{"$f":"VLOOKUP(C$13,Data!$D$22:$S$71,11,0)","v":{"v":32,"d":"32 V"}},{"$f":"VLOOKUP(D$13,Data!$D$22:$S$71,11,0)","v":{"v":32,"d":"32 V"}},{"$f":"VLOOKUP(E$13,Data!$D$22:$S$71,11,0)","v":{"v":32,"d":"32 V"}},{"$f":"VLOOKUP(F$13,Data!$D$22:$S$71,11,0)","v":{"v":32,"d":"32 V"}}]
[null,"Attack Time Range",{"$f":"VLOOKUP(C$13,Data!$D$22:$S$71,12,0)","v":{"v":1.5,"d":"1.5 ms"}},{"$f":"VLOOKUP(D$13,Data!$D$22:$S$71,12,0)","v":{"v":1.5,"d":"1.5 ms"}},{"$f":"VLOOKUP(E$13,Data!$D$22:$S$71,12,0)","v":{"v":1.5,"d":"1.5 ms"}},{"$f":"VLOOKUP(F$13,Data!$D$22:$S$71,12,0)","v":{"v":1.5,"d":"1.5 ms"}}]
[null,"Release Time Range",{"$f":"VLOOKUP(C$13,Data!$D$22:$S$71,13,0)","v":{"v":100,"d":"100 ms"}},{"$f":"VLOOKUP(D$13,Data!$D$22:$S$71,13,0)","v":{"v":100,"d":"100 ms"}},{"$f":"VLOOKUP(E$13,Data!$D$22:$S$71,13,0)","v":{"v":100,"d":"100 ms"}},{"$f":"VLOOKUP(F$13,Data!$D$22:$S$71,13,0)","v":{"v":100,"d":"100 ms"}}]
[null,"RMS Voltage",{"$f":"VLOOKUP(C$13,Data!$D$22:$S$71,14,0)","v":{"v":16,"d":"16 V"}},{"$f":"VLOOKUP(D$13,Data!$D$22:$S$71,14,0)","v":{"v":16,"d":"16 V"}},{"$f":"VLOOKUP(E$13,Data!$D$22:$S$71,14,0)","v":{"v":16,"d":"16 V"}},{"$f":"VLOOKUP(F$13,Data!$D$22:$S$71,14,0)","v":{"v":16,"d":"16 V"}}]
[null,"Attack Time Range",{"$f":"VLOOKUP(C$13,Data!$D$22:$S$71,15,0)","v":{"v":1,"d":"1.0 sec"}},{"$f":"VLOOKUP(D$13,Data!$D$22:$S$71,15,0)","v":{"v":1,"d":"1.0 sec"}},{"$f":"VLOOKUP(E$13,Data!$D$22:$S$71,15,0)","v":{"v":1,"d":"1.0 sec"}},{"$f":"VLOOKUP(F$13,Data!$D$22:$S$71,15,0)","v":{"v":1,"d":"1.0 sec"}}]
[null,"Release Time Range",{"$f":"VLOOKUP(C$13,Data!$D$22:$S$71,16,0)","v":{"v":2,"d":"2.0 sec"}},{"$f":"VLOOKUP(D$13,Data!$D$22:$S$71,16,0)","v":{"v":2,"d":"2.0 sec"}},{"$f":"VLOOKUP(E$13,Data!$D$22:$S$71,16,0)","v":{"v":2,"d":"2.0 sec"}},{"$f":"VLOOKUP(F$13,Data!$D$22:$S$71,16,0)","v":{"v":2,"d":"2.0 sec"}}]
[]
[]
[]
[]
[{"$nulls":12},"Consider adding continous power available lookup table (i.e. 1100W)"]
[{"$nulls":12},"Consider making B35 power requested"]
[]
[{"$nulls":12},"Consider peak power requested"]
[{"$nulls":12},"peak power availble"]

{"sheet":"Data","index":2,"n_rows":71,"n_cols":28,"rows_kept":71,"hidden":true,"merged":[[17,10,17,11]]}
["Amplifiers",null,"Channels","Peaks",null,"Rated power, symmetrical load",{"$nulls":5},"Total rated power",{"$nulls":4},"Rated power, asymmetrical load","Check 8 ohm","CTA fraction","Total Peak power available in W, 4 ohms","highest lo-z limiter setting in Armonia/CSD"]
[{"$nulls":3},"Vpk","Ipk","2Ω","4Ω","4Ω","8Ω","70V","100V",null,null,"8Ω","70V","100V","2Ω"]
[null,"PowerShareX 4804D",4,139,45,1500,1200,2600,1300,2100,2200,4800,null,1200,1200,1200,1800,{"$f":"N3*C3","v":4800},0.1,{"$f":"(D3^2)/4","v":{"v":4830.25,"d":"4830"}},140]
[null,"PowerShareX 2404D",4,100,45,800,600,1700,1300,1500,"170+C+K4",2400,null,600,600,600,1600,{"$f":"N4*C4","v":2400},0.1,{"$f":"(D4^2)/4","v":2500},100]
[null,"PowerShareX 1204D",4,70,33,400,300,1100,1100,1100,1100,1200,null,300,300,300,1100,{"$f":"N5*C5","v":1200},0.1,{"$f":"(D5^2)/4","v":1225},80]
[null,"PowerShare PS604D",4,100,"?","n/a",150,600,600,600,600,600,null,150,150,150,"n/a",{"$f":"N6*C6","v":600},null,{"$f":"(D6^2)/4","v":2500},100]
[null,"PowerShare PS404D",4,80,"?","n/a",100,400,400,400,400,400,null,100,100,100,"n/a",{"$f":"N7*C7","v":400},null,{"$f":"(D7^2)/4","v":1600},80]
[]
["Hi-Z/Lo-Z","Lo-Z"]
[null,"Hi-Z"]
[]
["Voltage standard","70V"]
[null,"100V","   "]
[null,null,40]
["Thresholds","\"Nearing\"",null,{"v":1,"d":"1.0 dB"}]
[null,"\"Exceeds\"",null,{"v":-2,"d":"-2.0 dB"}]
[{"$nulls":13},"NOT UPDATED LATELY 8/17/2023",{"$nulls":8},"DIP Switch Override"]
["Product family",null,null,"Product","RMS power (datasheet)","Nominal impedance","Max Hi-Z tap setting","Other Tap settings (lowest available black text tap is lowest available is also a 100v tap setting)",null,null,"Lowest tap setting (on this model, not available in 100v)",null,"Profile","V Peak threshold","Attack msec","Release msec","V RMS threshold","attac msec","release msec","Peak power (datasheet)","Typical program material",null,"PowerShare PSX1204D","PowerShare PSX2404D","PowerShare PSX4804D"]
[]
[{"$nulls":20},"CF + reactive","R:CTA ratio"]
[null,"None",null,"None",1e-11,0,0,{"$nulls":12},1e-11,0,0]
[{"$nulls":3},"FS2",16,16,16,8,4,2,1,null,"FR",32,1.5,100,16,1,2,64,10,0.19952623149688795]
[null,"FreeSpace + Acoustimass",null,"FS3 Surface",100,5,200,100,50,25,null,null,"FR",56,1.5,100,28,1,2,200,10,0.19952623149688795]
[null,"FreeSpace + Acoustimass",null,"FS3 Flush",100,6,200,100,50,25,null,null,"FR",56,1.5,100,28,1,2,200,10,0.19952623149688795]
[null,"FreeSpace small",null,"FS4",40,8,40,20,10,5,2.5,2.5,"FR",36,1.5,100,18,1,2,160,10,0.19952623149688795]
[null,"FreeSpace outdoor",null,"FS360P SII",65,8,80,40,20,10,null,null,"FR",45.5,1.5,100,23,1,2,320,10,0.19952623149688795]
[null,"DesignMax small",null,"DM2",16,16,9,4.5,2.3,1.2,null,null,"FR",32,1.5,100,16,1,2,64,10,0.19952623149688795]
[{"$nulls":3},"DM3",25,8,25,12,6,3,null,null,"FR",29,1.5,100,14.5,1,2,100,10,0.19952623149688795]
[null,"DesignMax large",null,"DM5",50,8,50,25,12,6,3,null,"FR",40,1.5,100,20,1,2,200,10,0.19952623149688795]
[{"$nulls":3},"DM6",100,8,80,40,20,10,5,2.5,"FR",56,1.5,100,28.5,1,2,400,10,0.19952623149688795]
[{"$nulls":3},"DM8",125,8,80,40,20,10,5,2.5,"FR",63,1.5,100,32.5,1,2,500,10,0.199526231496888]
[{"$nulls":3},"DML88P",140,8,100,50,25,12,null,null,"FR",56.5,1.5,100,28.5,1,2,400,10,0.199526231496888]
[{"$nulls":3},"DM12SE",200,8,{"$nulls":6},"FR",60,1.5,100,40,1,2,800,10,0.199526231496888]
[null,"DesignMax sub",null,"DM8C-Sub",150,8,150,80,40,20,null,null,"SW",69,1.5,100,34.5,1,2,600,10,0.19952623149688795]
[{"$nulls":3},"DM10S-Sub",250,8,150,80,40,20,null,null,"SW",88,1.5,100,45,1,2,1000,10,0.19952623149688795,"70V"]
[{"$nulls":3},"DM10P-Sub",250,8,150,80,40,20,null,null,"SW",69,1.5,100,34.5,1,2,1000,10,0.19952623149688795]
[null,"EdgeMax",null,"EM180",125,8,80,40,20,10,5,2.5,"FR",63,1.5,100,31.5,1,2,500,10,0.19952623149688795]
[{"$nulls":3},"EM180-LP",32,8,32,16,8,4,null,null,"FR",32,1,200,16,1,2,128,10,0.19952623149688795]
[{"$nulls":3},"EM90",125,8,80,40,20,10,5,2.5,"FR",63,1.5,100,31.5,1,2,500,10,0.19952623149688795,{"$nulls":5},"not from AK, assuming 1204D can do 80v clip on lo-z"]
[{"$nulls":3},"EM90-LP",32,8,32,16,8,4,null,null,"FR",32,1,200,16,1,2,128,10,0.19952623149688795]
[null,"Modular Array \ncolumn line array",null,"MA12",300,8,150,75,38,19,null,null,"FR",98,1.5,100,49,1,2,1200,17.2,0.03801893963205611,"100V","100V"]
[{"$nulls":3},"MA12EX",150,8,100,50,25,{"$nulls":3},"FR",69,1.5,100,35,1,2,600,16.8,0.04168693834703352,{"$nulls":5},"new Eqs added to list"]
[null,"Modular Bass sub",null,"MB210-WR",500,8,{"$nulls":6},"SW",126.5,1.5,100,63,1,2,2000,14,0.0794328234724281,"100V","100V"]
[null,"ArenaMatch Multipurpose",null,"AMM108",150,8,{"$nulls":6},"FR",71,1.5,100,34.5,0.5,0.5,1200,16.8,0.04168693834703352,"70V"]
[{"$nulls":3},"AMM112 FR",300,8,{"$nulls":6},"FR",142,1.5,100,49,0.5,0.5,2800,16.8,0.04168693834703352,"100V","100V"]
[{"$nulls":3},"AMM112 HF",45,8,{"$nulls":6},"HF",85,1.5,100,19,0.5,0.5,720,16.8,0.04168693834703352,"70V","Lo-Z"]
[{"$nulls":3},"AMM112 LF",300,8,{"$nulls":6},"LF",142,1.5,100,49,0.5,0.5,2800,16.8,0.04168693834703352,"100V","100V"]
[null,"ArenaMatch Multipurpose sub",null,"AMS115",500,8,{"$nulls":6},"SW",142,1.5,100,63,0.5,0.5,2800,14,0.0794328234724281,"100V","100V"]
[null,"ArenaMatch Utility",null,"AMU105",100,8,80,40,20,10,5,null,"FR",56.5,1.5,100,28.5,1,2,400,16.8,0.04168693834703352]
[{"$nulls":3},"AMU108",200,8,80,40,20,10,5,null,"FR",80,1.5,100,40,1,2,800,16.8,0.04168693834703352,"70V"]
[{"$nulls":3},"AMU206",250,8,80,40,20,10,5,null,"FR",89,1.5,100,44.5,1,2,1000,16.8,0.04168693834703352,"70V"]
[{"$nulls":3},"AMU208",300,8,80,40,20,10,5,null,"FR",98,1.5,100,49,1,2,1200,16.8,0.04168693834703352,"100V","100V"]
[null,"Forum",null,"FC108 FR",150,8,{"$nulls":6},"FR",71,1.5,100,34.5,1,2,1200,16.8,0.04168693834703352,"70V"]
[{"$nulls":3},"FC108 HF",20,8,{"$nulls":6},"HF",71,1.5,100,19,1,2,320,16.8,0.04168693834703352]
[{"$nulls":3},"FC108 LF",150,8,{"$nulls":6},"LF",71,1.5,100,34.5,1,2,1200,16.8,0.04168693834703352,"70V"]
[{"$nulls":3},"FC112 FR",300,8,{"$nulls":6},"FR",71,1.5,100,49,1,2,2400,16.8,0.04168693834703352,"100V","100V"]
[{"$nulls":3},"FC112 HF",45,8,{"$nulls":6},"HF",71,1.5,100,49,1,2,720,16.8,0.04168693834703352,"70V"]
[{"$nulls":3},"FC112 LF",300,8,{"$nulls":6},"LF",71,1.5,100,49,1,2,2400,16.8,0.04168693834703352,"100V","100V"]
[null,"ShowTime",null,"SK12",600,8,{"$nulls":6},"FR",{"$nulls":6},2400,16.8,0.04168693834703352,"100V","100V"]
[null,"ShowMatch",null,"SMS118",750,4,{"$nulls":6},"SW",109,1.5,100,55,1,2,3000,14,0.0794328234724281,"100V","100V"]
[{"$nulls":3},"SM5/10/20 LF",450,8,{"$nulls":6},"LF",120,1.5,100,60,1,2,1800,15.4,0.05754399373371569,"100V","100V"]
[{"$nulls":3},"SM5/10/20 HF",100,6,{"$nulls":6},"HF",49,1.5,100,24.5,1,2,400,19.8,0.020892961308540375]
[{"$nulls":3},"SMFill_LF",450,8,{"$nulls":6},"LF",120,1.5,100,60,1,2,1800,15.4,0.05754399373371569,"100V","100V"]
[{"$nulls":3},"SMFill_HF",100,6,{"$nulls":6},"HF",49,1.5,100,24.5,1,2,400,19.8,0.020892961308540375]
[{"$nulls":3},"SM_4Box_65_LF",450,8,{"$nulls":6},"LF",120,1.5,100,60,1,2,1800,15.4,0.05754399373371569,"100V","100V"]
[null,"ArenaMatch",null,"AM10/20/40 LF",600,8,400,200,100,{"$nulls":3},"FR",122,1.5,100,77.5,1,2,3000,16.8,0.04168693834703352,"100V","100V"]
[null,"ArenaMatch",null,"AM10/20/40 HF",150,8,400,200,100,{"$nulls":3},"FR",122,1.5,100,77.5,1,2,3000,16.8,0.04168693834703352,"100V"]
[null,"ArenaMatch",null,"AM10/20/40 Passive",750,8,400,200,100,{"$nulls":3},"FR",122,1.5,100,77.5,1,2,3000,16.8,0.04168693834703352,"100V","100V"]
[null,"ArenaMatch",null,"AMArray_LF",600,8,400,200,100,{"$nulls":3},"FR",122,1.5,100,77.5,1,2,3000,16.8,0.04168693834703352,"100V","100V"]
[null,"Series V",null,"402_SeriesV",150,8,{"$nulls":6},"FR",62,1.5,100,31,1,2,600,16.8,0.04168693834703352]
[null,"Series V",null,"802_SeriesV",300,8,{"$nulls":6},"FR",71,1.5,100,44,1,null,1200,16.8,0.04168693834703352,"70V"]