{"text_format":"3","workbook":"xlsx","n_sheets":3,"sheets":["Disclaimer","Tool","Data"],"not_rendered":{"images":20,"macros":1,"comments":4},"read":"whole","date_system":"1900"}

{"sheet":"Disclaimer","index":0,"n_rows":1,"n_cols":4,"rows_kept":1,"merged":[[0,3,14,9]]}
[{"$nulls":3},"Enable macros to use PowerShare Design Tool\n\nIf you experience a security risk warning, go to the file's properties > general tab > at the bottom security >  unblock \n\nThis tool is designed to help you to understand the power sharing capabilities in PowerShareX amplifiers. With this tool you can choose an amplifier and specify the loudspeakers for the system configuration you want to review. Results are estimated values and may be used as a starting point for your system design.  Please also refer to the amplifier technical data sheets when reviewing your system design plan.\n\nv1.0.3 add loudspeaker options for DesignMax DML88P and DM12SE, EdgeMax EM180-LP and EM90-LP, Forum FC108 and FC112, ShowTime SK12, 402 Series V, and 802 Series V."]

{"sheet":"Tool","index":1,"n_rows":175,"n_cols":43,"rows_kept":175,"merged":[[8,2,8,3],[10,2,10,9],[10,10,10,11],[15,10,15,11],[29,10,29,11],[30,28,30,29],[30,30,30,31],[32,2,32,9],[101,2,101,9],[138,35,139,35]]}
[{"$nulls":10},{"$f":"IF(E10<0.999*O43,\"I<Imax\",IF(E10>1.001*O43,\"I>Imax\",\"I@Imax\"))","v":"I>Imax"},{"$f":"IF(L39>0.01,\"Pdes<Pmax\",IF(L39<-0.01,\"Pdes>Pmax\",\"Pdes@Pmax\"))","v":"Pdes<Pmax"},{"$f":"IF(L4=\"Pavg ok\",IF(K4>3,CONCATENATE(\"The amplifier should only need \",ROUND(K132,1),\"A as an average over time. \"),\"\"),\"\")","v":"The amplifier should only need 0.4A as an average over time. "},null,null,"PS404D","PS604D","Quattrocanali 8804",{"$f":"LEN(S2)","v":19},null,null,"T904","T604","T304","X4","X4L"]
[null,null,"Hi-Z calculator",{"$nulls":3},"Lo-Z",{"$nulls":3},"Pmains max at ",{"$f":"MAX(K132,AVERAGE(O12/O40/C10,O42/C10))","v":{"v":6.415694591728526,"d":"6.4 Arms"}},{"$f":"IF(K1=\"I<Imax\",IF(K3<-0.01,IF(L1=\"Pdes<Pmax\",IF(L4=\"Pavg<Pdes\",\"The amplifier can deliver the desired average power if the mains current is increased. \",\"\"),\"\"),\"\"),\"\")","v":""},"Amplifier data","Selected",{"$nulls":3},"PowerShare PSX4804D","PowerShare PSX2404D","PowerShare PSX1204D",{"$nulls":13},"Voltage alternatives"]
[null,null,"P",{"v":60,"d":"60 W"},null,null,"100V",{"$f":"SQRT(2)*100","v":{"v":141.4213562373095,"d":"141.4"}},null,null,{"$f":"10*LOG10(L2/O43)","v":{"v":-0.6781758147655953,"d":"-0.7 dB"}},"vs Imax",{"$f":"IF(E10<L2,IF(L1=\"Pdes>Pmax\",IF(K5<-0.01,\"It can get closer to the desired average power with a higher mains current availability. \",\"\"),\"\"),\"\")","v":""},"Max Ptot, burst",{"$f":"INDEX(P3:Z3,1,MATCH(C$9,P$2:Z$2,0))","v":{"v":1200,"d":"1200 W"}},{"v":400,"d":"400 W"},{"v":600,"d":"600 W"},{"v":9600,"d":"9600 W"},{"v":6000,"d":"6000 W"},{"v":2400,"d":"2400 W"},{"v":1200,"d":"1200 W"},{"v":8000,"d":"8000 W"},{"v":6000,"d":"6000 W"},{"v":3000,"d":"3000 W"},{"v":20800,"d":"20800 W"},{"$f":"MIN(IF($C$35:$F$35>8200,25000,32800))","v":{"v":32800,"d":"32800 W"}},{"$f":"MIN(IF($C$35:$F$35>150,500,600))","v":{"v":600,"d":"600 W"}},{"$nulls":7},100]
[null,null,"Znom 25V",{"$f":"25^2/D3","v":{"v":10.416666666666666,"d":"10.4 ohm"}},null,null,"70V",{"v":100,"d":"100.0"},null,null,{"$f":"10*LOG10(E10/K132)","v":{"v":15.25399035619138,"d":"15.3 dB"}},{"$f":"IF(K138<-0.01,\"Pavg<Pdes\",\"Pavg ok\")","v":"Pavg ok"},{"$f":"IF(E10>L2*1.01,IF(E10<0.99*O43,IF(L4=\"Pavg<Pdes\",CONCATENATE(\"The desired total average power exceeds the capacity. It's expected to draw around \",ROUND(L2,1),\"A when it reaches its total average power capacity so increasing the available current won't let it reach the desired average power. \"),\"\"),\"\"),\"\")","v":""},null,null,{"v":100,"d":"100 W"},{"v":150,"d":"150 W"},{"v":2400,"d":"2400 W"},{"v":1200,"d":"1200 W"},{"v":600,"d":"600 W"},{"v":300,"d":"300 W"},{"v":2000,"d":"2000 W"},{"v":1250,"d":"1250 W"},{"v":750,"d":"750 W"},{"v":5200,"d":"5200 W"},{"v":4800,"d":"4800 W"},{"$nulls":8},115]
[null,null,"Znom 70V",{"$f":"100^2/2/D3","v":{"v":83.33333333333333,"d":"83.3 ohm"}},null,null,"Unused",{"$f":"SQRT(2)*25","v":{"v":35.35533905932738,"d":"35.4"}},null,null,{"$f":"10*LOG10(E10/L2)","v":{"v":3.6884757714054075,"d":"3.7 dB"}},null,{"$f":"IF(E10>O43*1.01,CONCATENATE(\"The amplifier is limited to \",O43,\"A. \"),\"\")","v":"The amplifier is limited to 7.5A. "},null,null,{"$f":"P3/8","v":{"v":50,"d":"50 W"}},{"$f":"Q3/8","v":{"v":75,"d":"75 W"}},{"$f":"R3/8","v":{"v":1200,"d":"1200 W"}},{"$f":"S3/8","v":{"v":750,"d":"750 W"}},{"$f":"T3/8","v":{"v":300,"d":"300 W"}},{"v":150,"d":"150 W"},{"v":1000,"d":"1000 W"},{"v":750,"d":"750 W"},{"v":375,"d":"375 W"},{"$f":"Y3/8","v":{"v":2600,"d":"2600 W"}},{"$f":"Z3/8","v":{"v":4100,"d":"4100 W"}},{"$nulls":8},120]
[null,null,"Znom 100V",{"$f":"100^2/D3","v":{"v":166.66666666666666,"d":"166.7 ohm"}},null,null,"Unused",{"$nulls":8},{"$f":"(P12-P39)*P16","v":{"v":55.875,"d":"56 W"}},{"v":85.715,"d":"86 W"},{"v":816.1999999999999,"d":"816 W"},{"v":875.4319999999999,"d":"875 W"},{"v":514.632,"d":"515 W"},{"v":424.432,"d":"424 W"},{"v":874.5,"d":"875 W"},{"v":875.4319999999999,"d":"875 W"},{"v":424.432,"d":"424 W"},{"v":1375.05,"d":"1375 W"},{"v":4289.8,"d":"4290 W"},{"$nulls":8},125]
[null,null,"PowerShare Design Tool",{"$nulls":10},"Max Ptot, avg",{"$f":"INDEX(P7:Z7,1,MATCH(C$9,P$2:Z$2,0))","v":{"v":360,"d":"360 W"}},{"$f":"MIN(P6,ROUND(AVERAGE(P6,P6,P6,P5),-1))","v":{"v":50,"d":"50 W"}},{"$f":"MIN(Q6,ROUND(AVERAGE(Q6,Q6,Q6,Q5),-1))","v":{"v":80,"d":"80 W"}},{"$f":"MIN(R6,ROUND(AVERAGE(R6,R6,R6,R5),-1))","v":{"v":816.1999999999999,"d":"816 W"}},{"$f":"MIN(S6,ROUND(AVERAGE(S6,S6,S6,S5),-1))","v":{"v":840,"d":"840 W"}},{"$f":"MIN(T6,ROUND(AVERAGE(T6,T6,T6,T5),-1))","v":{"v":460,"d":"460 W"}},{"v":360,"d":"360 W"},{"v":874.5,"d":"875 W"},{"v":840,"d":"840 W"},{"v":410,"d":"410 W"},{"$f":"(Y12-Y39)*Y31","v":{"v":1344.15,"d":"1344 W"}},{"$f":"(Z12-Z39)*Z31","v":{"v":4193.4,"d":"4193 W"}},{"$nulls":8},173]
[null,"User Input ",{"$nulls":10},"Instructions","Max Pburst/ch",{"$f":"INDEX(P8:Z8,1,MATCH(C$9,P$2:Z$2,0))","v":{"v":1100,"d":"1100 W"}},{"v":320,"d":"320 W"},{"v":600,"d":"600 W"},{"v":3500,"d":"3500 W"},{"v":2200,"d":"2200 W"},{"v":1200,"d":"1200 W"},{"v":1100,"d":"1100 W"},{"v":2300,"d":"2300 W"},{"v":2100,"d":"2100 W"},{"v":1200,"d":"1200 W"},{"v":5400,"d":"5400 W"},{"v":10000,"d":"10000 W"},{"$nulls":5},"Nominal",{"v":400,"d":"400 W"},null,208]
[null,"Amplifier model","PowerShare PSX1204D",{"$nulls":9},"Enable macros to use PowerShare Design Tool!","Lo-Z voltage",{"$f":"INDEX(P9:Z9,1,MATCH(C$9,P$2:Z$2,0))","v":{"v":70,"d":"70 Vpk"}},{"v":142,"d":"142.0 Vpk"},{"v":142,"d":"142.0 Vpk"},{"v":160,"d":"160.0 Vpk"},{"v":139,"d":"139.0 Vpk"},{"v":100,"d":"100.0 Vpk"},{"v":70,"d":"70.0 Vpk"},{"v":170,"d":"170.0 Vpk"},{"v":145,"d":"145.0 Vpk"},{"v":140,"d":"140.0 Vpk"},{"v":161,"d":"161 Vpk"},{"v":283,"d":"283.0 Vpk"},{"$nulls":5},"Actual",{"v":162,"d":"162 W"},null,220]
[null,"Mains",{"v":115,"d":"115 V"},{"v":15,"d":"15 A"},{"$f":"$D$10","v":{"v":15,"d":"15 A"}},{"$nulls":8},"Max Apeak/ch",{"$f":"INDEX(P10:Z10,1,MATCH(C$9,P$2:Z$2,0))","v":{"v":43,"d":"43 Apk"}},{"v":17.8,"d":"18 Apk"},{"v":17.8,"d":"18 Apk"},{"v":50,"d":"50 Apk"},{"v":45,"d":"45 Apk"},{"v":43,"d":"43 Apk"},{"v":43,"d":"43 Apk"},{"v":50,"d":"50 Apk"},{"v":40,"d":"40 Apk"},{"v":40,"d":"40 Apk"},{"v":86,"d":"86 Apk"},{"v":118,"d":"118 Apk"},{"$nulls":5},"Unused",{"$f":"AG8-AG9","v":{"v":238,"d":"238 W"}},null,230]
[null,null,"Channel",{"$nulls":9},"Gray cells = user adjustment","Max Vpeak/ch",{"v":145,"d":"145 Vpk"},{"v":142,"d":"142 Vpk"},{"v":142,"d":"142 Vpk"},{"v":160,"d":"160 Vpk"},{"v":139,"d":"139 Vpk"},{"v":145,"d":"145 Vpk"},{"v":145,"d":"145 Vpk"},{"v":169,"d":"169 Vpk"},{"v":145,"d":"145 Vpk"},{"v":145,"d":"145 Vpk"},{"v":161,"d":"161 Vpk"},{"v":283,"d":"283 Vpk"},{"$nulls":6},{"$f":"-10*LOG10(AG9/AG8)","v":{"v":3.925449767853314,"d":"3.9 dB"}},null,240]
[null,"Loudspeaker Information",1,2,3,4,5,6,7,8,{"$nulls":3},"P act mains slow",{"v":550,"d":"550 W"},{"v":90,"d":"90 W"},{"v":128,"d":"128 W"},{"v":1200,"d":"1200 W"},{"v":1100,"d":"1100 W"},{"v":660,"d":"660 W"},{"v":550,"d":"550 W"},{"v":1200,"d":"1200 W"},{"v":1100,"d":"1100 W"},{"v":550,"d":"550 W"},{"$f":"IF($C10*$E10>5000,5000,($C10*$E10))","v":{"v":1725,"d":"1725 W"}},{"v":5000,"d":"5000 W"}]
[null,"Bose Professional Loudspeaker ","FS2","FS2","FS2","FS2",{"$nulls":6},"Select loudspeaker."]
[null,"Loudspeaker type ","Lo-Z","Lo-Z","Lo-Z","Lo-Z","Unused","Unused","Unused","Unused",null,null,"Select: Lo-Z / 100V / 70V / Unused. Unused must be selected when appropriate for headroom to\n be accurate. "]
[null,"Loudspeaker type OLD HIDDEN","Lo-Z","Lo-Z","Lo-Z","Lo-Z"]
[null,"#Speakers in parallel ",1,1,1,1,1,1,1,1,null,null,"Enter number of parallel speakers per channel.","n_net_eff1",{"$f":"INDEX(P16:Z16,1,MATCH(C$9,P$2:Z$2,0))","v":{"v":0.82,"d":"82%"}},{"v":0.75,"d":"75%"},{"v":0.79,"d":"79%"},{"v":0.7,"d":"70%"},{"v":0.82,"d":"82%"},{"v":0.82,"d":"82%"},{"v":0.82,"d":"82%"},{"v":0.75,"d":"75%"},{"v":0.82,"d":"82%"},{"v":0.82,"d":"82%"},{"v":0.89,"d":"89%"},{"v":0.89,"d":"89%"}]
[null,"#Cabinets in parallel OLD HIDDEN",1,1,1,1]
[null,"Tap Setting (70/100V) ",{"v":16,"d":"16 W"},{"v":16,"d":"16 W"},{"v":16,"d":"16 W"},{"v":16,"d":"16 W"},{"$nulls":6},"Select.  Note that the lowest tap is sometimes not available in 100v, check technical data sheet for \n details"]
[null,"RMS power - single speaker ",{"$f":"VLOOKUP(C$13,Data!$D$22:$F$71,2,0)","v":{"v":16,"d":"16 W"}},{"$f":"VLOOKUP(D$13,Data!$D$22:$F$71,2,0)","v":{"v":16,"d":"16 W"}},{"$f":"VLOOKUP(E$13,Data!$D$22:$F$71,2,0)","v":{"v":16,"d":"16 W"}},{"$f":"VLOOKUP(F$13,Data!$D$22:$F$71,2,0)","v":{"v":16,"d":"16 W"}}]
[null,"Nominal impedance Lo-Z OLD HIDDEN",{"$f":"VLOOKUP(C$13,Data!$D$22:$F$71,3,0)","v":{"v":16,"d":"16.0 ohm"}},{"$f":"VLOOKUP(D$13,Data!$D$22:$F$71,3,0)","v":{"v":16,"d":"16.0 ohm"}},{"$f":"VLOOKUP(E$13,Data!$D$22:$F$71,3,0)","v":{"v":16,"d":"16.0 ohm"}},{"$f":"VLOOKUP(F$13,Data!$D$22:$F$71,3,0)","v":{"v":16,"d":"16.0 ohm"}}]
[null,"Highest Tap choice 70V/100V",{"$f":"IF(VLOOKUP(C$13,Data!$D$22:$L$71,4,0)=\"\",\"\",VLOOKUP(C$13,Data!$D$22:$L$71,4,0))","v":{"v":16,"d":"16 W"}},{"$f":"IF(VLOOKUP(D$13,Data!$D$22:$L$71,4,0)=\"\",\"\",VLOOKUP(D$13,Data!$D$22:$L$71,4,0))","v":{"v":16,"d":"16 W"}},{"$f":"IF(VLOOKUP(E$13,Data!$D$22:$L$71,4,0)=\"\",\"\",VLOOKUP(E$13,Data!$D$22:$L$71,4,0))","v":{"v":16,"d":"16 W"}},{"$f":"IF(VLOOKUP(F$13,Data!$D$22:$L$71,4,0)=\"\",\"\",VLOOKUP(F$13,Data!$D$22:$L$71,4,0))","v":{"v":16,"d":"16 W"}},{"$nulls":21},"Profile","Active power","Crest factor","Average reduction","RMS Scaling"]
[null,"Next Tap choice 70V/100V",{"$f":"IF(VLOOKUP(C$13,Data!$D$22:$L$71,5,0)=\"\",\"\",VLOOKUP(C$13,Data!$D$22:$L$71,5,0))","v":{"v":8,"d":"8 W"}},{"$f":"IF(VLOOKUP(D$13,Data!$D$22:$L$71,5,0)=\"\",\"\",VLOOKUP(D$13,Data!$D$22:$L$71,5,0))","v":{"v":8,"d":"8 W"}},{"$f":"IF(VLOOKUP(E$13,Data!$D$22:$L$71,5,0)=\"\",\"\",VLOOKUP(E$13,Data!$D$22:$L$71,5,0))","v":{"v":8,"d":"8 W"}},{"$f":"IF(VLOOKUP(F$13,Data!$D$22:$L$71,5,0)=\"\",\"\",VLOOKUP(F$13,Data!$D$22:$L$71,5,0))","v":{"v":8,"d":"8 W"}},{"$nulls":21},"SW",{"v":14,"d":"14 dB"},{"v":12,"d":"12 dB"},{"v":2,"d":"2.0 dB"},{"v":0.7,"d":"0.70"}]
[null,"Next Tap choice 70V/100V",{"$f":"IF(VLOOKUP(C$13,Data!$D$22:$L$71,6,0)=\"\",\"\",VLOOKUP(C$13,Data!$D$22:$L$71,6,0))","v":{"v":4,"d":"4 W"}},{"$f":"IF(VLOOKUP(D$13,Data!$D$22:$L$71,6,0)=\"\",\"\",VLOOKUP(D$13,Data!$D$22:$L$71,6,0))","v":{"v":4,"d":"4 W"}},{"$f":"IF(VLOOKUP(E$13,Data!$D$22:$L$71,6,0)=\"\",\"\",VLOOKUP(E$13,Data!$D$22:$L$71,6,0))","v":{"v":4,"d":"4 W"}},{"$f":"IF(VLOOKUP(F$13,Data!$D$22:$L$71,6,0)=\"\",\"\",VLOOKUP(F$13,Data!$D$22:$L$71,6,0))","v":{"v":4,"d":"4 W"}},{"$nulls":21},"LF",{"$f":"AD23+AE23","v":{"v":15.4,"d":"15 dB"}},{"v":14,"d":"14 dB"},{"v":1.4,"d":"1.4 dB"},0.65]
[null,"Next Tap choice 70V/100V",{"$f":"IF(VLOOKUP(C$13,Data!$D$22:$L$71,7,0)=\"\",\"\",VLOOKUP(C$13,Data!$D$22:$L$71,7,0))","v":{"v":2,"d":"2 W"}},{"$f":"IF(VLOOKUP(D$13,Data!$D$22:$L$71,7,0)=\"\",\"\",VLOOKUP(D$13,Data!$D$22:$L$71,7,0))","v":{"v":2,"d":"2 W"}},{"$f":"IF(VLOOKUP(E$13,Data!$D$22:$L$71,7,0)=\"\",\"\",VLOOKUP(E$13,Data!$D$22:$L$71,7,0))","v":{"v":2,"d":"2 W"}},{"$f":"IF(VLOOKUP(F$13,Data!$D$22:$L$71,7,0)=\"\",\"\",VLOOKUP(F$13,Data!$D$22:$L$71,7,0))","v":{"v":2,"d":"2 W"}},{"$nulls":21},"MF",{"$f":"AD24+AE24","v":{"v":17.2,"d":"17 dB"}},{"v":16,"d":"16 dB"},{"v":1.2,"d":"1.2 dB"},{"v":0.6,"d":"0.60"}]
[null,"Next Tap choice 70V/100V",{"$f":"IF(VLOOKUP(C$13,Data!$D$22:$L$71,8,0)=\"\",\"\",VLOOKUP(C$13,Data!$D$22:$L$71,8,0))","v":{"v":1,"d":"1 W"}},{"$f":"IF(VLOOKUP(D$13,Data!$D$22:$L$71,8,0)=\"\",\"\",VLOOKUP(D$13,Data!$D$22:$L$71,8,0))","v":{"v":1,"d":"1 W"}},{"$f":"IF(VLOOKUP(E$13,Data!$D$22:$L$71,8,0)=\"\",\"\",VLOOKUP(E$13,Data!$D$22:$L$71,8,0))","v":{"v":1,"d":"1 W"}},{"$f":"IF(VLOOKUP(F$13,Data!$D$22:$L$71,8,0)=\"\",\"\",VLOOKUP(F$13,Data!$D$22:$L$71,8,0))","v":{"v":1,"d":"1 W"}},{"$nulls":6}," (Lowest tap sometimes not available in 100v, check loudspeaker technical data sheet)",{"$nulls":14},"HF",{"$f":"AD25+AE25","v":{"v":19.8,"d":"20 dB"}},{"v":19,"d":"19 dB"},{"v":0.8,"d":"0.8 dB"},0.55]
[null,"Next Tap choice 70V/100V",{"$f":"IF(VLOOKUP(C$13,Data!$D$22:$L$71,9,0)=\"\",\"\",VLOOKUP(C$13,Data!$D$22:$L$71,9,0))","v":""},{"$f":"IF(VLOOKUP(D$13,Data!$D$22:$L$71,9,0)=\"\",\"\",VLOOKUP(D$13,Data!$D$22:$L$71,9,0))","v":""},{"$f":"IF(VLOOKUP(E$13,Data!$D$22:$L$71,9,0)=\"\",\"\",VLOOKUP(E$13,Data!$D$22:$L$71,9,0))","v":""},{"$f":"IF(VLOOKUP(F$13,Data!$D$22:$L$71,9,0)=\"\",\"\",VLOOKUP(F$13,Data!$D$22:$L$71,9,0))","v":""},{"$nulls":21},"FR",{"$f":"AD26+AE26","v":{"v":16.820599913279622,"d":"17 dB"}},{"$f":"10*LOG10(40)","v":{"v":16.02059991327962,"d":"16 dB"}},{"v":0.8,"d":"0.8 dB"},{"v":0.6,"d":"0.60"}]
[null,"Profile HIDDEN",{"$f":"VLOOKUP(C$13,Data!$D$22:$M$71,10,0)","v":"FR"},{"$f":"VLOOKUP(D$13,Data!$D$22:$M$71,10,0)","v":"FR"},{"$f":"VLOOKUP(E$13,Data!$D$22:$M$71,10,0)","v":"FR"},{"$f":"VLOOKUP(F$13,Data!$D$22:$M$71,10,0)","v":"FR"}]
[null,"Z nominal (LO-Z)",{"$f":"C20","v":{"v":16,"d":"16.0 ohm"}},{"$f":"D20","v":{"v":16,"d":"16.0 ohm"}},{"$f":"E20","v":{"v":16,"d":"16.0 ohm"}},{"$f":"F20","v":{"v":16,"d":"16.0 ohm"}},{"v":4,"d":"4.0 ohm"},{"v":4,"d":"4.0 ohm"},{"v":4,"d":"4.0 ohm"},{"v":4,"d":"4.0 ohm"},null,null,"Nominal impedance (when used in LO-Z)",null,{"$f":"INDEX(P28:Z28,1,MATCH(C$9,P$2:Z$2,0))","v":{"v":990,"d":"990 W"}},{"$f":"0.9*P8","v":{"v":288,"d":"288 W"}},{"v":540,"d":"540 W"},{"v":3150,"d":"3150 W"},{"v":1980,"d":"1980 W"},{"v":1080,"d":"1080 W"},{"v":990,"d":"990 W"},{"v":2070,"d":"2070 W"},{"v":1890,"d":"1890 W"},{"v":1080,"d":"1080 W"},{"v":5400,"d":"5400 W"},{"v":10000,"d":"10000 W"}]
[null,"PRMS (or Hi-Z tap setting)  ",{"$f":"IF(C14=\"Lo-Z\",C19,IF(C14=\"70V\",C18,IF(C14=\"100V\",C18,\"\")))","v":{"v":16,"d":"16 W"}},{"$f":"IF(D14=\"Lo-Z\",D19,IF(D14=\"70V\",D18,IF(D14=\"100V\",D18,\"\")))","v":{"v":16,"d":"16 W"}},{"$f":"IF(E14=\"Lo-Z\",E19,IF(E14=\"70V\",E18,IF(E14=\"100V\",E18,\"\")))","v":{"v":16,"d":"16 W"}},{"$f":"IF(F14=\"Lo-Z\",F19,IF(F14=\"70V\",F18,IF(F14=\"100V\",F18,\"\")))","v":{"v":16,"d":"16 W"}},{"v":100,"d":"100 W"},{"v":100,"d":"100 W"},{"v":100,"d":"100 W"},{"v":100,"d":"100 W"},null,null,"Bose Professional Power Handling, Long-term Continuous for one cabinet\n or the tap value of a Hi-Z loudspeaker","P ch slow",{"v":300,"d":"300 W"},{"v":36,"d":"36 W"},{"v":68,"d":"68 W"},{"v":550,"d":"550 W"},{"v":550,"d":"550 W"},{"v":300,"d":"300 W"},{"v":300,"d":"300 W"},{"v":550,"d":"550 W"},{"v":550,"d":"550 W"},{"v":300,"d":"300 W"},{"$f":"Y28/4","v":{"v":1350,"d":"1350 W"}},{"$f":"Z28/4","v":{"v":2500,"d":"2500 W"}}]
[null,"Profile HIDDEN",{"$f":"C27","v":"FR"},{"$f":"D27","v":"FR"},{"$f":"E27","v":"FR"},{"$f":"F27","v":"FR"},"SW","SW","SW","SW",null,null,"Select: SW / LF / MF / HF / FR","Vpk1",{"$f":"INDEX(P30:Z30,1,MATCH(C$9,P$2:Z$2,0))","v":{"v":145,"d":"145 Vpk"}},{"v":73,"d":"73 Vpk"},{"v":98,"d":"98 Vpk"},{"v":163,"d":"163 Vpk"},{"v":145,"d":"145 Vpk"},{"v":145,"d":"145 Vpk"},{"v":145,"d":"145 Vpk"},{"v":167,"d":"167 Vpk"},{"v":145,"d":"145 Vpk"},{"v":140,"d":"140 Vpk"},{"v":161,"d":"161 Vpk"},{"v":283,"d":"283 Vpk"}]
{"$rows_left_out":122}
{"sheet":"Data","index":2,"n_rows":71,"n_cols":28,"rows_kept":71,"hidden":true,"merged":[[17,10,17,11]]}
["Amplifiers",null,"Channels","Peaks",null,"Rated power, symmetrical load",{"$nulls":5},"Total rated power",{"$nulls":4},"Rated power, asymmetrical load","Check 8 ohm","CTA fraction","Total Peak power available in W, 4 ohms","highest lo-z limiter setting in Armonia/CSD"]
[{"$nulls":3},"Vpk","Ipk","2Ω","4Ω","4Ω","8Ω","70V","100V",null,null,"8Ω","70V","100V","2Ω"]
[null,"PowerShareX 4804D",4,139,45,1500,1200,2600,1300,2100,2200,4800,null,1200,1200,1200,1800,{"$f":"N3*C3","v":4800},0.1,{"$f":"(D3^2)/4","v":{"v":4830.25,"d":"4830"}},140]
[null,"PowerShareX 2404D",4,100,45,800,600,1700,1300,1500,"170+C+K4",2400,null,600,600,600,1600,{"$f":"N4*C4","v":2400},0.1,{"$f":"(D4^2)/4","v":2500},100]
[null,"PowerShareX 1204D",4,70,33,400,300,1100,1100,1100,1100,1200,null,300,300,300,1100,{"$f":"N5*C5","v":1200},0.1,{"$f":"(D5^2)/4","v":1225},80]
[null,"PowerShare PS604D",4,100,"?","n/a",150,600,600,600,600,600,null,150,150,150,"n/a",{"$f":"N6*C6","v":600},null,{"$f":"(D6^2)/4","v":2500},100]
[null,"PowerShare PS404D",4,80,"?","n/a",100,400,400,400,400,400,null,100,100,100,"n/a",{"$f":"N7*C7","v":400},null,{"$f":"(D7^2)/4","v":1600},80]
[]
["Hi-Z/Lo-Z","Lo-Z"]
[null,"Hi-Z"]
[]
["Voltage standard","70V"]
[null,"100V","   "]
[null,null,40]
["Thresholds","\"Nearing\"",null,{"v":1,"d":"1.0 dB"}]
[null,"\"Exceeds\"",null,{"v":-2,"d":"-2.0 dB"}]
[{"$nulls":13},"NOT UPDATED LATELY 8/17/2023",{"$nulls":8},"DIP Switch Override"]
["Product family",null,null,"Product","RMS power (datasheet)","Nominal impedance","Max Hi-Z tap setting","Other Tap settings (lowest available black text tap is lowest available is also a 100v tap setting)",null,null,"Lowest tap setting (on this model, not available in 100v)",null,"Profile","V Peak threshold","Attack msec","Release msec","V RMS threshold","attac msec","release msec","Peak power (datasheet)","Typical program material",null,"PowerShare PSX1204D","PowerShare PSX2404D","PowerShare PSX4804D"]
[]
[{"$nulls":20},"CF + reactive","R:CTA ratio"]
[null,"None",null,"None",1e-11,0,0,{"$nulls":12},1e-11,0,0]
[{"$nulls":3},"FS2",16,16,16,8,4,2,1,null,"FR",32,1.5,100,16,1,2,64,10,0.19952623149688795]
[null,"FreeSpace + Acoustimass",null,"FS3 Surface",100,5,200,100,50,25,null,null,"FR",56,1.5,100,28,1,2,200,10,0.19952623149688795]
[null,"FreeSpace + Acoustimass",null,"FS3 Flush",100,6,200,100,50,25,null,null,"FR",56,1.5,100,28,1,2,200,10,0.19952623149688795]
[null,"FreeSpace small",null,"FS4",40,8,40,20,10,5,2.5,2.5,"FR",36,1.5,100,18,1,2,160,10,0.19952623149688795]
[null,"FreeSpace outdoor",null,"FS360P SII",65,8,80,40,20,10,null,null,"FR",45.5,1.5,100,23,1,2,320,10,0.19952623149688795]
[null,"DesignMax small",null,"DM2",16,16,9,4.5,2.3,1.2,null,null,"FR",32,1.5,100,16,1,2,64,10,0.19952623149688795]
[{"$nulls":3},"DM3",25,8,25,12,6,3,null,null,"FR",29,1.5,100,14.5,1,2,100,10,0.19952623149688795]
[null,"DesignMax large",null,"DM5",50,8,50,25,12,6,3,null,"FR",40,1.5,100,20,1,2,200,10,0.19952623149688795]
[{"$nulls":3},"DM6",100,8,80,40,20,10,5,2.5,"FR",56,1.5,100,28.5,1,2,400,10,0.19952623149688795]
{"$rows_left_out":41}